BDBM50316817 4-phenyl-1-((S)-2-((S)-2-(5-phenylisoxazole-3-carbonyl)pyrrolidine-1-carbonyl)pyrrolidin-1-yl)butan-1-one::CHEMBL1086967
SMILES: O=C(CCCc1ccccc1)N1CCC[C@H]1C(=O)N1CCC[C@H]1C(=O)c1cc(on1)-c1ccccc1
InChI Key: InChIKey=FSZXXIKEXZAOLC-DQEYMECFSA-N
Data: 1 IC50
Activity Spreadsheet -- Enzyme Inhibition Constant Data from BindingDB
Found 1 hit for monomerid = 50316817
Trg + Lig
Ki
nM
ΔG°
kcal/mole
IC50
nM
Kd
nM
EC50/IC50
nM
koff
s-1
kon
M-1s-1
pHTemp
°C
Prolyl endopeptidase
(Sus scrofa)
BDBM50316817
(4-phenyl-1-((S)-2-((S)-2-(5-phenylisoxazole-3-carb...)
Show SMILES O=C(CCCc1ccccc1)N1CCC[C@H]1C(=O)N1CCC[C@H]1C(=O)c1cc(on1)-c1ccccc1 |r|
Show InChI InChI=1S/C29H31N3O4/c33-27(17-7-12-21-10-3-1-4-11-21)31-18-9-16-25(31)29(35)32-19-8-15-24(32)28(34)23-20-26(36-30-23)22-13-5-2-6-14-22/h1-6,10-11,13-14,20,24-25H,7-9,12,15-19H2/t24-,25-/m0/s1
n/an/a 1.60n/an/an/an/an/an/a
McGill University
Curated by ChEMBL
Assay Description
Inhibition of pig POP
J Med Chem 53: 3423-38 (2010)
Article DOI: 10.1021/jm901104g
BindingDB Entry DOI: 10.7270/Q261119N