BDBM50316823 ((2S,3aS,7aS)-1-((1R,2R)-2-phenylcyclopropanecarbonyl)octahydro-1H-indol-2-yl)(pyrrolidin-1-yl)methanone::CHEMBL1087219
SMILES: O=C([C@@H]1C[C@H]1c1ccccc1)N1[C@H]2CCCC[C@H]2C[C@H]1C(=O)N1CCCC1
InChI Key: InChIKey=GIAAMKCACACNCN-WHZJULEDSA-N
Data: 1 IC50
Activity Spreadsheet -- Enzyme Inhibition Constant Data from BindingDB
Found 1 hit for monomerid = 50316823
Trg + Lig
Ki
nM
ΔG°
kcal/mole
IC50
nM
Kd
nM
EC50/IC50
nM
koff
s-1
kon
M-1s-1
pHTemp
°C
Prolyl endopeptidase
(Rattus norvegicus)
BDBM50316823
(((2S,3aS,7aS)-1-((1R,2R)-2-phenylcyclopropanecarbo...)
Show SMILES O=C([C@@H]1C[C@H]1c1ccccc1)N1[C@H]2CCCC[C@H]2C[C@H]1C(=O)N1CCCC1 |r|
Show InChI InChI=1S/C23H30N2O2/c26-22(19-15-18(19)16-8-2-1-3-9-16)25-20-11-5-4-10-17(20)14-21(25)23(27)24-12-6-7-13-24/h1-3,8-9,17-21H,4-7,10-15H2/t17-,18-,19+,20-,21-/m0/s1
n/an/a 1.20n/an/an/an/an/an/a
McGill University
Curated by ChEMBL
Assay Description
inhibition of rat cortex POP
J Med Chem 53: 3423-38 (2010)
Article DOI: 10.1021/jm901104g
BindingDB Entry DOI: 10.7270/Q261119N