BDBM50317139 5-(2-(diethylamino)ethylamino)-7-hydroxy-10-methoxy-6H-imidazo[4,5,1-de]acridin-6-one::5-(2-Diethylamino-ethylamino)-7-hydroxy-10-methoxy-2,10b-diaza-aceanthrylen-6-one::CHEMBL8219::NSC-660840
SMILES: CCN(CC)CCNc1ccc2ncn3c2c1c(=O)c1c(O)ccc(OC)c31
InChI Key: InChIKey=AWMRRELRWBHCHQ-UHFFFAOYSA-N
Data: 1 IC50
Activity Spreadsheet -- Enzyme Inhibition Constant Data from BindingDB
Found 1 hit for monomerid = 50317139
Trg + Lig
Ki
nM
ΔG°
kcal/mole
IC50
nM
Kd
nM
EC50/IC50
nM
koff
s-1
kon
M-1s-1
pHTemp
°C
Ribosyldihydronicotinamide dehydrogenase [quinone]
(Homo sapiens (Human))
BDBM50317139
(5-(2-(diethylamino)ethylamino)-7-hydroxy-10-methox...)
Show SMILES CCN(CC)CCNc1ccc2ncn3c2c1c(=O)c1c(O)ccc(OC)c31
Show InChI InChI=1S/C21H24N4O3/c1-4-24(5-2)11-10-22-13-6-7-14-19-17(13)21(27)18-15(26)8-9-16(28-3)20(18)25(19)12-23-14/h6-9,12,22,26H,4-5,10-11H2,1-3H3
n/an/a 31n/an/an/an/an/an/a
the University of Manchester and Manchester Cancer Research Center
Curated by ChEMBL
Assay Description
Inhibition of human recombinant NQO2 assessed as reduction of DCPIP by spectrophotometry
Bioorg Med Chem Lett 20: 2832-6 (2010)
Article DOI: 10.1016/j.bmcl.2010.03.051
BindingDB Entry DOI: 10.7270/Q2FB533K