BDBM50317172 (2'Z,3'E)-5-Trifluoromethoxy-5'-fluoro-indirubin-3'-oxime::CHEMBL1086700
SMILES: Fc1ccc2[nH]c(C3C(=O)Nc4ccc(OC(F)(F)F)cc34)c(N=O)c2c1
InChI Key: InChIKey=DMKBKAZVQRUOSI-UHFFFAOYSA-N
Data: 1 IC50
Activity Spreadsheet -- Enzyme Inhibition Constant Data from BindingDB
Found 1 hit for monomerid = 50317172
Trg + Lig
Ki
nM
ΔG°
kcal/mole
IC50
nM
Kd
nM
EC50/IC50
nM
koff
s-1
kon
M-1s-1
pHTemp
°C
CDK2/CycE
(Homo sapiens (Human))
BDBM50317172
((2'Z,3'E)-5-Trifluoromethoxy-5'-fluoro-indirubin-3...)
Show SMILES Fc1ccc2[nH]c(C3C(=O)Nc4ccc(OC(F)(F)F)cc34)c(N=O)c2c1
Show InChI InChI=1S/C17H9F4N3O3/c18-7-1-3-12-10(5-7)14(24-26)15(22-12)13-9-6-8(27-17(19,20)21)2-4-11(9)23-16(13)25/h1-6,13,22H,(H,23,25)
n/an/a 60n/an/an/an/an/an/a
Institute of Science and Technology
Curated by ChEMBL
Assay Description
Inhibition of CDK2/cyclin E
J Med Chem 53: 3696-706 (2010)
Article DOI: 10.1021/jm100080z
BindingDB Entry DOI: 10.7270/Q2X92BFT