BDBM50317173 (2'Z,3'E)-5-Nitro-5'-methyl-indirubin-3'-oxime::CHEMBL1086701
SMILES: Cc1ccc2[nH]c(c(N=[OH+])c2c1)-[c-]1c2cc(ccc2[nH]c1=O)[N+]([O-])=O
InChI Key: InChIKey=OVTXBIJINAVYNK-UHFFFAOYSA-O
Data: 1 IC50
Activity Spreadsheet -- Enzyme Inhibition Constant Data from BindingDB
Found 1 hit for monomerid = 50317173
Trg + Lig
Ki
nM
ΔG°
kcal/mole
IC50
nM
Kd
nM
EC50/IC50
nM
koff
s-1
kon
M-1s-1
pHTemp
°C
CDK2/CycE
(Homo sapiens (Human))
BDBM50317173
((2'Z,3'E)-5-Nitro-5'-methyl-indirubin-3'-oxime | C...)
Show SMILES Cc1ccc2[nH]c(c(N=[OH+])c2c1)-[c-]1c2cc(ccc2[nH]c1=O)[N+]([O-])=O |(23.35,-22.07,;24.68,-22.84,;24.68,-24.38,;26.01,-25.15,;27.35,-24.38,;28.82,-24.86,;29.73,-23.61,;28.82,-22.35,;29.3,-20.89,;30.8,-20.57,;27.34,-22.83,;26.01,-22.07,;31.27,-23.61,;32.17,-22.36,;31.85,-20.86,;32.98,-19.83,;34.46,-20.3,;34.78,-21.81,;33.64,-22.84,;33.64,-24.38,;32.18,-24.85,;31.7,-26.32,;32.66,-18.33,;33.79,-17.29,;31.19,-17.86,)|
Show InChI InChI=1S/C17H11N4O4/c1-8-2-4-13-11(6-8)15(20-23)16(18-13)14-10-7-9(21(24)25)3-5-12(10)19-17(14)22/h2-7,18H,1H3,(H,19,22)/q-1/p+1
n/an/a 8.70n/an/an/an/an/an/a
Institute of Science and Technology
Curated by ChEMBL
Assay Description
Inhibition of CDK2/cyclin E
J Med Chem 53: 3696-706 (2010)
Article DOI: 10.1021/jm100080z
BindingDB Entry DOI: 10.7270/Q2X92BFT