BDBM50317182 2-[12-(beta-Carboline-2-ium-2-yl)dodecyl]-beta-carboline-2-ium dibromide::CHEMBL1088377
SMILES: C(CCCCCC[n+]1ccc2c(c1)[nH]c1ccccc21)CCCCC[n+]1ccc2c(c1)[nH]c1ccccc21
InChI Key: InChIKey=VCJGRMVHAYBWRI-UHFFFAOYSA-P
Data: 4 IC50
Activity Spreadsheet -- Enzyme Inhibition Constant Data from BindingDB
Found 4 hits for monomerid = 50317182
Trg + Lig
Ki
nM
ΔG°
kcal/mole
IC50
nM
Kd
nM
EC50/IC50
nM
koff
s-1
kon
M-1s-1
pHTemp
°C
GluN1/GluN2B NMDA receptor
(Homo sapiens (Human))
BDBM50317182
(2-[12-(beta-Carboline-2-ium-2-yl)dodecyl]-beta-car...)
Show SMILES C(CCCCCC[n+]1ccc2c(c1)[nH]c1ccccc21)CCCCC[n+]1ccc2c(c1)[nH]c1ccccc21
Show InChI InChI=1S/C34H38N4/c1(3-5-7-13-21-37-23-19-29-27-15-9-11-17-31(27)35-33(29)25-37)2-4-6-8-14-22-38-24-20-30-28-16-10-12-18-32(28)36-34(30)26-38/h9-12,15-20,23-26H,1-8,13-14,21-22H2/p+2
NCI pathway
Reactome pathway
n/an/a 1.80E+3n/an/an/an/an/an/a
Friedrich-Schiller-Universitat Jena
Curated by ChEMBL
Assay Description
Inhibition of dexamethasone-induced human NR1-1a/NR2B receptor-mediated excitotoxicity in (S)-glutamate/glycine-stimulated mouse L13-E6 cells assesse...
J Med Chem 53: 3611-7 (2010)
Article DOI: 10.1021/jm1000024
BindingDB Entry DOI: 10.7270/Q2SJ1KS0
Acetylcholinesterase
(Electrophorus electricus (Electric eel))
BDBM50317182
(2-[12-(beta-Carboline-2-ium-2-yl)dodecyl]-beta-car...)
Show SMILES C(CCCCCC[n+]1ccc2c(c1)[nH]c1ccccc21)CCCCC[n+]1ccc2c(c1)[nH]c1ccccc21
Show InChI InChI=1S/C34H38N4/c1(3-5-7-13-21-37-23-19-29-27-15-9-11-17-31(27)35-33(29)25-37)2-4-6-8-14-22-38-24-20-30-28-16-10-12-18-32(28)36-34(30)26-38/h9-12,15-20,23-26H,1-8,13-14,21-22H2/p+2
n/an/a 86n/an/an/an/an/an/a
Friedrich-Schiller-Universitat Jena
Curated by ChEMBL
Assay Description
Inhibition of electric eel AChE by modified Ellman's method
J Med Chem 53: 3611-7 (2010)
Article DOI: 10.1021/jm1000024
BindingDB Entry DOI: 10.7270/Q2SJ1KS0
Butyrylcholinesterase (BuChE)
(Equus caballus (Horse))
BDBM50317182
(2-[12-(beta-Carboline-2-ium-2-yl)dodecyl]-beta-car...)
Show SMILES C(CCCCCC[n+]1ccc2c(c1)[nH]c1ccccc21)CCCCC[n+]1ccc2c(c1)[nH]c1ccccc21
Show InChI InChI=1S/C34H38N4/c1(3-5-7-13-21-37-23-19-29-27-15-9-11-17-31(27)35-33(29)25-37)2-4-6-8-14-22-38-24-20-30-28-16-10-12-18-32(28)36-34(30)26-38/h9-12,15-20,23-26H,1-8,13-14,21-22H2/p+2
n/an/a 22n/an/an/an/an/an/a
Friedrich-Schiller-Universitat Jena
Curated by ChEMBL
Assay Description
Inhibition of equine serum BChE by modified Ellman's method
J Med Chem 53: 3611-7 (2010)
Article DOI: 10.1021/jm1000024
BindingDB Entry DOI: 10.7270/Q2SJ1KS0
NR1/NR2A
(Homo sapiens (Human))
BDBM50317182
(2-[12-(beta-Carboline-2-ium-2-yl)dodecyl]-beta-car...)
Show SMILES C(CCCCCC[n+]1ccc2c(c1)[nH]c1ccccc21)CCCCC[n+]1ccc2c(c1)[nH]c1ccccc21
Show InChI InChI=1S/C34H38N4/c1(3-5-7-13-21-37-23-19-29-27-15-9-11-17-31(27)35-33(29)25-37)2-4-6-8-14-22-38-24-20-30-28-16-10-12-18-32(28)36-34(30)26-38/h9-12,15-20,23-26H,1-8,13-14,21-22H2/p+2
NCI pathway
Reactome pathway
n/an/a 2.60E+3n/an/an/an/an/an/a
Friedrich-Schiller-Universitat Jena
Curated by ChEMBL
Assay Description
Inhibition of dexamethasone-induced human NR1-1a/NR2A receptor-mediated excitotoxicity in (S)-glutamate/glycine-stimulated mouse L12-G10 cells assess...
J Med Chem 53: 3611-7 (2010)
Article DOI: 10.1021/jm1000024
BindingDB Entry DOI: 10.7270/Q2SJ1KS0