BDBM50317409 5-(Aminosulfonyl)-N-(2-pyridin-2-ylethyl)-2-[(2,3,5,6-tetrafluorophenyl)thio]nicotinamide::CHEMBL1095531
SMILES: NS(=O)(=O)c1ccc(Sc2c(F)c(F)cc(F)c2F)c(c1)C(=O)NCCc1ccccn1
InChI Key: InChIKey=DNLAXQXZFNLJHG-UHFFFAOYSA-N
Data: 2 IC50
Activity Spreadsheet -- Enzyme Inhibition Constant Data from BindingDB
Found 2 hits for monomerid = 50317409
Trg + Lig
Ki
nM
ΔG°
kcal/mole
IC50
nM
Kd
nM
EC50/IC50
nM
koff
s-1
kon
M-1s-1
pHTemp
°C
Carbonic anhydrase 4
(Homo sapiens (Human))
BDBM50317409
(5-(Aminosulfonyl)-N-(2-pyridin-2-ylethyl)-2-[(2,3,...)
Show SMILES NS(=O)(=O)c1ccc(Sc2c(F)c(F)cc(F)c2F)c(c1)C(=O)NCCc1ccccn1
Show InChI InChI=1S/C20H15F4N3O3S2/c21-14-10-15(22)18(24)19(17(14)23)31-16-5-4-12(32(25,29)30)9-13(16)20(28)27-8-6-11-3-1-2-7-26-11/h1-5,7,9-10H,6,8H2,(H,27,28)(H2,25,29,30)
Reactome pathway
n/an/a 20.9n/an/an/an/an/an/a
Pfizer Global Research and Development
Curated by ChEMBL
Assay Description
Inhibition of carbonic anhydrase 4
Bioorg Med Chem 18: 3307-19 (2010)
Article DOI: 10.1016/j.bmc.2010.03.014
BindingDB Entry DOI: 10.7270/Q2SQ91B9
Carbonic anhydrase 2
(Homo sapiens (Human))
BDBM50317409
(5-(Aminosulfonyl)-N-(2-pyridin-2-ylethyl)-2-[(2,3,...)
Show SMILES NS(=O)(=O)c1ccc(Sc2c(F)c(F)cc(F)c2F)c(c1)C(=O)NCCc1ccccn1
Show InChI InChI=1S/C20H15F4N3O3S2/c21-14-10-15(22)18(24)19(17(14)23)31-16-5-4-12(32(25,29)30)9-13(16)20(28)27-8-6-11-3-1-2-7-26-11/h1-5,7,9-10H,6,8H2,(H,27,28)(H2,25,29,30)
Reactome pathway
n/an/a 18.4n/an/an/an/an/an/a
Pfizer Global Research and Development
Curated by ChEMBL
Assay Description
Inhibition of carbonic anhydrase 2
Bioorg Med Chem 18: 3307-19 (2010)
Article DOI: 10.1016/j.bmc.2010.03.014
BindingDB Entry DOI: 10.7270/Q2SQ91B9