BDBM50317639 4-[3-[6-(5-Benzo[1,3]dioxol-5-yl-biphenyl-3-yloxy)-hexyl]-2-(2-carboxy-ethyl)-phenoxy]-butyric acid::CHEMBL1099337
SMILES: OC(=O)CCCOc1cccc(CCCCCCOc2cc(cc(c2)-c2ccc3OCOc3c2)-c2ccccc2)c1CCC(O)=O
InChI Key: InChIKey=RDVXKYQJMAGJEF-UHFFFAOYSA-N
Data: 1 IC50
Activity Spreadsheet -- Enzyme Inhibition Constant Data from BindingDB
Found 1 hit for monomerid = 50317639
Trg + Lig
Ki
nM
ΔG°
kcal/mole
IC50
nM
Kd
nM
EC50/IC50
nM
koff
s-1
kon
M-1s-1
pHTemp
°C
Leukotriene B4 receptor
(Homo sapiens (Human))
BDBM50317639
(4-[3-[6-(5-Benzo[1,3]dioxol-5-yl-biphenyl-3-yloxy)...)
Show SMILES OC(=O)CCCOc1cccc(CCCCCCOc2cc(cc(c2)-c2ccc3OCOc3c2)-c2ccccc2)c1CCC(O)=O
Show InChI InChI=1S/C38H40O8/c39-37(40)15-9-21-44-34-14-8-13-28(33(34)17-19-38(41)42)12-4-1-2-7-20-43-32-23-30(27-10-5-3-6-11-27)22-31(24-32)29-16-18-35-36(25-29)46-26-45-35/h3,5-6,8,10-11,13-14,16,18,22-25H,1-2,4,7,9,12,15,17,19-21,26H2,(H,39,40)(H,41,42)
n/an/a 0.580n/an/an/an/an/an/a
Roche Research Center
Curated by ChEMBL
Assay Description
Antagonist activity at BLT1 receptor expressed in human HL60 cells assessed as inhibition of LTB4-stimulated calcium flux after 30 mins
J Med Chem 53: 3502-16 (2010)
Article DOI: 10.1021/jm1001919
BindingDB Entry DOI: 10.7270/Q2KW5G67