BDBM50317669 CHEMBL1094659::N-((2S,5S)-5-((S)-1-((1R,2S)-1-(3-(4,5-Dihydro-5-oxo-1,2,4-oxadiazol-3-yl)phenylcarbamoyl)-1-hydroxy-3-phenylpropan-2-ylcarbamoyl)-3-methylbutylcarbamoyl)-2-amino-6-methyl-3-oxoheptyl)-5-fluoro-1,2,3,6-tetrahydro-2,6-dioxopyrimidine-4-carboxamide
SMILES: CC(C)C[C@H](NC(=O)[C@@H](NC(=O)[C@@H](N)CNC(=O)c1[nH]c(=O)[nH]c(=O)c1F)C(C)C)C(=O)N[C@@H](Cc1ccccc1)[C@@H](O)C(=O)Nc1cccc(c1)-c1nc(=O)o[nH]1
InChI Key: InChIKey=NXCQPFBHQDPWNN-JYIQTIOUSA-N
Data: 1 IC50
Activity Spreadsheet -- Enzyme Inhibition Constant Data from BindingDB
Found 1 hit for monomerid = 50317669
Trg + Lig
Ki
nM
ΔG°
kcal/mole
IC50
nM
Kd
nM
EC50/IC50
nM
koff
s-1
kon
M-1s-1
pHTemp
°C
Beta-secretase 1
(Homo sapiens (Human))
BDBM50317669
(CHEMBL1094659 | N-((2S,5S)-5-((S)-1-((1R,2S)-1-(3-...)
Show SMILES CC(C)C[C@H](NC(=O)[C@@H](NC(=O)[C@@H](N)CNC(=O)c1[nH]c(=O)[nH]c(=O)c1F)C(C)C)C(=O)N[C@@H](Cc1ccccc1)[C@@H](O)C(=O)Nc1cccc(c1)-c1nc(=O)o[nH]1 |r|
Show InChI InChI=1S/C37H45FN10O10/c1-17(2)13-24(43-34(54)26(18(3)4)44-30(50)22(39)16-40-33(53)27-25(38)32(52)47-36(56)45-27)31(51)42-23(14-19-9-6-5-7-10-19)28(49)35(55)41-21-12-8-11-20(15-21)29-46-37(57)58-48-29/h5-12,15,17-18,22-24,26,28,49H,13-14,16,39H2,1-4H3,(H,40,53)(H,41,55)(H,42,51)(H,43,54)(H,44,50)(H,46,48,57)(H2,45,47,52,56)/t22-,23-,24-,26-,28+/m0/s1
n/an/a 7.90n/an/an/an/an/an/a
Kyoto Pharmaceutical University
Curated by ChEMBL
Assay Description
Inhibition of human BACE1 by FRET assay
Bioorg Med Chem 18: 3175-86 (2010)
Article DOI: 10.1016/j.bmc.2010.03.032
BindingDB Entry DOI: 10.7270/Q26M36ZV