BDBM50317700 (4-cyclobutyl-1,4-diazepan-1-yl)((2R,4S)-4-(4-fluorophenoxy)pyrrolidin-2-yl)methanone::CHEMBL1095846
SMILES: Fc1ccc(O[C@@H]2CN[C@H](C2)C(=O)N2CCCN(CC2)C2CCC2)cc1
InChI Key: InChIKey=RKXDBMQRODRNSK-RBUKOAKNSA-N
Data: 2 KI  3 IC50  1 Kd
Activity Spreadsheet -- Enzyme Inhibition Constant Data from BindingDB
Found 6 hits for monomerid = 50317700
Trg + Lig
Ki
nM
ΔG°
kcal/mole
IC50
nM
Kd
nM
EC50/IC50
nM
koff
s-1
kon
M-1s-1
pHTemp
°C
Histamine H3 receptor
(Homo sapiens (Human))
BDBM50317700
((4-cyclobutyl-1,4-diazepan-1-yl)((2R,4S)-4-(4-fluo...)
Show SMILES Fc1ccc(O[C@@H]2CN[C@H](C2)C(=O)N2CCCN(CC2)C2CCC2)cc1 |r|
Show InChI InChI=1S/C20H28FN3O2/c21-15-5-7-17(8-6-15)26-18-13-19(22-14-18)20(25)24-10-2-9-23(11-12-24)16-3-1-4-16/h5-8,16,18-19,22H,1-4,9-14H2/t18-,19+/m0/s1
Reactome pathway
1.60n/an/an/an/an/an/an/an/a
Johnson& Johnson Pharmaceutical Research& Development L.L.C.
Curated by ChEMBL
Assay Description
Binding affinity to human histamine H3 receptor
Bioorg Med Chem Lett 20: 2755-60 (2010)
Article DOI: 10.1016/j.bmcl.2010.03.071
BindingDB Entry DOI: 10.7270/Q2Z60P7S
Histamine H3 receptor
(Homo sapiens (Human))
BDBM50317700
((4-cyclobutyl-1,4-diazepan-1-yl)((2R,4S)-4-(4-fluo...)
Show SMILES Fc1ccc(O[C@@H]2CN[C@H](C2)C(=O)N2CCCN(CC2)C2CCC2)cc1 |r|
Show InChI InChI=1S/C20H28FN3O2/c21-15-5-7-17(8-6-15)26-18-13-19(22-14-18)20(25)24-10-2-9-23(11-12-24)16-3-1-4-16/h5-8,16,18-19,22H,1-4,9-14H2/t18-,19+/m0/s1
Reactome pathway
1.60n/an/an/an/an/an/an/an/a
Bioprojet-Biotech
Curated by ChEMBL
Assay Description
Displacement of [125I]Iodoproxyfan from human recombinant histamine H3 receptor by Competitive binding assay
Bioorg Med Chem Lett 21: 5378-83 (2011)
Article DOI: 10.1016/j.bmcl.2011.07.006
BindingDB Entry DOI: 10.7270/Q2VX0GXK
Histamine H3 receptor
(Rattus norvegicus (rat))
BDBM50317700
((4-cyclobutyl-1,4-diazepan-1-yl)((2R,4S)-4-(4-fluo...)
Show SMILES Fc1ccc(O[C@@H]2CN[C@H](C2)C(=O)N2CCCN(CC2)C2CCC2)cc1 |r|
Show InChI InChI=1S/C20H28FN3O2/c21-15-5-7-17(8-6-15)26-18-13-19(22-14-18)20(25)24-10-2-9-23(11-12-24)16-3-1-4-16/h5-8,16,18-19,22H,1-4,9-14H2/t18-,19+/m0/s1
Reactome pathway
n/an/an/a 11.8n/an/an/an/an/a
Johnson& Johnson Pharmaceutical Research& Development L.L.C.
Curated by ChEMBL
Assay Description
Antagonist activity at rat H3 receptor expressed in human SK-N-MC cells assessed as inhibition of forskolin-induced cAMP accumulation after 6 hrs
Bioorg Med Chem Lett 20: 2755-60 (2010)
Article DOI: 10.1016/j.bmcl.2010.03.071
BindingDB Entry DOI: 10.7270/Q2Z60P7S
Potassium voltage-gated channel subfamily H member 2
(Homo sapiens (Human))
BDBM50317700
((4-cyclobutyl-1,4-diazepan-1-yl)((2R,4S)-4-(4-fluo...)
Show SMILES Fc1ccc(O[C@@H]2CN[C@H](C2)C(=O)N2CCCN(CC2)C2CCC2)cc1 |r|
Show InChI InChI=1S/C20H28FN3O2/c21-15-5-7-17(8-6-15)26-18-13-19(22-14-18)20(25)24-10-2-9-23(11-12-24)16-3-1-4-16/h5-8,16,18-19,22H,1-4,9-14H2/t18-,19+/m0/s1
Reactome pathway
n/an/a 1.00E+4n/an/an/an/an/an/a
Bioprojet-Biotech
Curated by ChEMBL
Assay Description
Displacement of [3H]dofetilide from human recombinant ERG by Competitive binding assay
Bioorg Med Chem Lett 21: 5378-83 (2011)
Article DOI: 10.1016/j.bmcl.2011.07.006
BindingDB Entry DOI: 10.7270/Q2VX0GXK
Potassium voltage-gated channel subfamily H member 2
(Homo sapiens (Human))
BDBM50317700
((4-cyclobutyl-1,4-diazepan-1-yl)((2R,4S)-4-(4-fluo...)
Show SMILES Fc1ccc(O[C@@H]2CN[C@H](C2)C(=O)N2CCCN(CC2)C2CCC2)cc1 |r|
Show InChI InChI=1S/C20H28FN3O2/c21-15-5-7-17(8-6-15)26-18-13-19(22-14-18)20(25)24-10-2-9-23(11-12-24)16-3-1-4-16/h5-8,16,18-19,22H,1-4,9-14H2/t18-,19+/m0/s1
Reactome pathway
n/an/a>1.00E+4n/an/an/an/an/an/a
Johnson& Johnson Pharmaceutical Research& Development L.L.C.
Curated by ChEMBL
Assay Description
Displacement of labeled dofetilide human ERG
Bioorg Med Chem Lett 20: 2755-60 (2010)
Article DOI: 10.1016/j.bmcl.2010.03.071
BindingDB Entry DOI: 10.7270/Q2Z60P7S
Potassium voltage-gated channel subfamily H member 2
(Homo sapiens (Human))
BDBM50317700
((4-cyclobutyl-1,4-diazepan-1-yl)((2R,4S)-4-(4-fluo...)
Show SMILES Fc1ccc(O[C@@H]2CN[C@H](C2)C(=O)N2CCCN(CC2)C2CCC2)cc1 |r|
Show InChI InChI=1S/C20H28FN3O2/c21-15-5-7-17(8-6-15)26-18-13-19(22-14-18)20(25)24-10-2-9-23(11-12-24)16-3-1-4-16/h5-8,16,18-19,22H,1-4,9-14H2/t18-,19+/m0/s1
Reactome pathway
n/an/a 7.80E+3n/an/an/an/an/an/a
Johnson& Johnson Pharmaceutical Research& Development L.L.C.
Curated by ChEMBL
Assay Description
Inhibition of human ERG by patch clamp assay
Bioorg Med Chem Lett 20: 2755-60 (2010)
Article DOI: 10.1016/j.bmcl.2010.03.071
BindingDB Entry DOI: 10.7270/Q2Z60P7S