BDBM50317804 3-allyl 5-ethyl 2,6-dimethyl-4-(3-nitrophenyl)-1,4-dihydropyridine-3,5-dicarboxylate::CHEMBL1096518
SMILES: CCOC(=O)C1C(C(C(=O)OCC=C)=C(C)N=C1C)c1cccc(c1)[N+]([O-])=O
InChI Key: InChIKey=VFGLOQVGJPDFIT-UHFFFAOYSA-N
Data: 2 IC50
Activity Spreadsheet -- Enzyme Inhibition Constant Data from BindingDB
Found 2 hits for monomerid = 50317804
Trg + Lig
Ki
nM
ΔG°
kcal/mole
IC50
nM
Kd
nM
EC50/IC50
nM
koff
s-1
kon
M-1s-1
pHTemp
°C
Voltage-gated L-type calcium channel alpha-1C subunit
(Oryctolagus cuniculus)
BDBM50317804
(3-allyl 5-ethyl 2,6-dimethyl-4-(3-nitrophenyl)-1,4...)
Show SMILES CCOC(=O)C1C(C(C(=O)OCC=C)=C(C)N=C1C)c1cccc(c1)[N+]([O-])=O |c:16,t:13|
Show InChI InChI=1S/C20H22N2O6/c1-5-10-28-20(24)17-13(4)21-12(3)16(19(23)27-6-2)18(17)14-8-7-9-15(11-14)22(25)26/h5,7-9,11,16,18H,1,6,10H2,2-4H3
Reactome pathway
n/an/a 25n/an/an/an/an/an/a
Northwestern University
Curated by ChEMBL
Assay Description
Antagonist activity at rabbit Cav1.2 expressed in HEK293 cells assessed as inhibition of voltage pulse-induced calcium current by FLIPR calcium 4 ass...
Bioorg Med Chem 18: 3147-58 (2010)
Article DOI: 10.1016/j.bmc.2010.03.038
BindingDB Entry DOI: 10.7270/Q2F47P90
Cav1.3/Cav beta3/Cav alpha2delta complex
(Rattus norvegicus)
BDBM50317804
(3-allyl 5-ethyl 2,6-dimethyl-4-(3-nitrophenyl)-1,4...)
Show SMILES CCOC(=O)C1C(C(C(=O)OCC=C)=C(C)N=C1C)c1cccc(c1)[N+]([O-])=O |c:16,t:13|
Show InChI InChI=1S/C20H22N2O6/c1-5-10-28-20(24)17-13(4)21-12(3)16(19(23)27-6-2)18(17)14-8-7-9-15(11-14)22(25)26/h5,7-9,11,16,18H,1,6,10H2,2-4H3
Reactome pathway
n/an/a 15n/an/an/an/an/an/a
Northwestern University
Curated by ChEMBL
Assay Description
Antagonist activity at rat Cav1.3 expressed in HEK293 cells assessed as inhibition of voltage pulse-induced calcium current by FLIPR calcium 4 assay
Bioorg Med Chem 18: 3147-58 (2010)
Article DOI: 10.1016/j.bmc.2010.03.038
BindingDB Entry DOI: 10.7270/Q2F47P90