BDBM50317808 3-ethyl 5-(2-methoxyethyl)2,6-dimethyl-4-(3-nitrophenyl)-1,4-dihydropyridine-3,5-dicarboxylate::CHEMBL1097857
SMILES: CCOC(=O)C1C(C(C(=O)OCCOC)=C(C)N=C1C)c1cccc(c1)[N+]([O-])=O
InChI Key: InChIKey=HYOVUNOASVUIDZ-UHFFFAOYSA-N
Data: 2 IC50
Activity Spreadsheet -- Enzyme Inhibition Constant Data from BindingDB
Found 2 hits for monomerid = 50317808
Trg + Lig
Ki
nM
ΔG°
kcal/mole
IC50
nM
Kd
nM
EC50/IC50
nM
koff
s-1
kon
M-1s-1
pHTemp
°C
Voltage-gated L-type calcium channel alpha-1C subunit
(Oryctolagus cuniculus)
BDBM50317808
(3-ethyl 5-(2-methoxyethyl)2,6-dimethyl-4-(3-nitrop...)
Show SMILES CCOC(=O)C1C(C(C(=O)OCCOC)=C(C)N=C1C)c1cccc(c1)[N+]([O-])=O |c:17,t:14|
Show InChI InChI=1S/C20H24N2O7/c1-5-28-19(23)16-12(2)21-13(3)17(20(24)29-10-9-27-4)18(16)14-7-6-8-15(11-14)22(25)26/h6-8,11,16,18H,5,9-10H2,1-4H3
Reactome pathway
n/an/a 16n/an/an/an/an/an/a
Northwestern University
Curated by ChEMBL
Assay Description
Antagonist activity at rabbit Cav1.2 expressed in HEK293 cells assessed as inhibition of voltage pulse-induced calcium current by FLIPR calcium 4 ass...
Bioorg Med Chem 18: 3147-58 (2010)
Article DOI: 10.1016/j.bmc.2010.03.038
BindingDB Entry DOI: 10.7270/Q2F47P90
Cav1.3/Cav beta3/Cav alpha2delta complex
(Rattus norvegicus)
BDBM50317808
(3-ethyl 5-(2-methoxyethyl)2,6-dimethyl-4-(3-nitrop...)
Show SMILES CCOC(=O)C1C(C(C(=O)OCCOC)=C(C)N=C1C)c1cccc(c1)[N+]([O-])=O |c:17,t:14|
Show InChI InChI=1S/C20H24N2O7/c1-5-28-19(23)16-12(2)21-13(3)17(20(24)29-10-9-27-4)18(16)14-7-6-8-15(11-14)22(25)26/h6-8,11,16,18H,5,9-10H2,1-4H3
Reactome pathway
n/an/a 82n/an/an/an/an/an/a
Northwestern University
Curated by ChEMBL
Assay Description
Antagonist activity at rat Cav1.3 expressed in HEK293 cells assessed as inhibition of voltage pulse-induced calcium current by FLIPR calcium 4 assay
Bioorg Med Chem 18: 3147-58 (2010)
Article DOI: 10.1016/j.bmc.2010.03.038
BindingDB Entry DOI: 10.7270/Q2F47P90