null
SMILES: COC(=O)C1C(C(C(=O)OC2Cc3ccccc3C2)=C(C)N=C1C)c1cccc(c1)[N+]([O-])=O
InChI Key: InChIKey=RIFLJFURLDLFTB-UHFFFAOYSA-N
Activity Spreadsheet -- Enzyme Inhibition Constant Data from BindingDB
Found 2 hits for monomerid = 50317828
Trg + Lig
Ki
nM
ΔG°
kcal/mole
IC50
nM
Kd
nM
EC50/IC50
nM
koff
s-1
kon
M-1s-1
pHTemp
°C
Voltage-dependent L-type calcium channel subunit alpha-1C
(Oryctolagus cuniculus)
BDBM50317828
(3-(2,3-dihydro-1H-inden-2-yl)5-methyl 2,6-dimethyl...)
Show SMILES COC(=O)C1C(C(C(=O)OC2Cc3ccccc3C2)=C(C)N=C1C)c1cccc(c1)[N+]([O-])=O |c:23,t:20|
Show InChI InChI=1S/C25H24N2O6/c1-14-21(24(28)32-3)23(18-9-6-10-19(11-18)27(30)31)22(15(2)26-14)25(29)33-20-12-16-7-4-5-8-17(16)13-20/h4-11,20-21,23H,12-13H2,1-3H3
Reactome pathway
n/an/a 72n/an/an/an/an/an/a
Northwestern University
Curated by ChEMBL
Assay Description
Antagonist activity at rabbit Cav1.2 expressed in HEK293 cells assessed as inhibition of voltage pulse-induced calcium current by FLIPR calcium 4 ass...
Bioorg Med Chem 18: 3147-58 (2010)
Article DOI: 10.1016/j.bmc.2010.03.038
BindingDB Entry DOI: 10.7270/Q2F47P90
Voltage-dependent L-type calcium channel subunit alpha-1D
(Rattus norvegicus)
BDBM50317828
(3-(2,3-dihydro-1H-inden-2-yl)5-methyl 2,6-dimethyl...)
Show SMILES COC(=O)C1C(C(C(=O)OC2Cc3ccccc3C2)=C(C)N=C1C)c1cccc(c1)[N+]([O-])=O |c:23,t:20|
Show InChI InChI=1S/C25H24N2O6/c1-14-21(24(28)32-3)23(18-9-6-10-19(11-18)27(30)31)22(15(2)26-14)25(29)33-20-12-16-7-4-5-8-17(16)13-20/h4-11,20-21,23H,12-13H2,1-3H3
Reactome pathway
n/an/a 43n/an/an/an/an/an/a
Northwestern University
Curated by ChEMBL
Assay Description
Antagonist activity at rat Cav1.3 expressed in HEK293 cells assessed as inhibition of voltage pulse-induced calcium current by FLIPR calcium 4 assay
Bioorg Med Chem 18: 3147-58 (2010)
Article DOI: 10.1016/j.bmc.2010.03.038
BindingDB Entry DOI: 10.7270/Q2F47P90