BDBM50317832 3-methyl 5-(4-phenylbutyl)2,6-dimethyl-4-(3-nitrophenyl)-1,4-dihydropyridine-3,5-dicarboxylate::CHEMBL1096501
SMILES: COC(=O)C1C(C(C(=O)OCCCCc2ccccc2)=C(C)N=C1C)c1cccc(c1)[N+]([O-])=O
InChI Key: InChIKey=NUVCGNYKSUFXRR-UHFFFAOYSA-N
Data: 2 IC50
Activity Spreadsheet -- Enzyme Inhibition Constant Data from BindingDB
Found 2 hits for monomerid = 50317832
Trg + Lig
Ki
nM
ΔG°
kcal/mole
IC50
nM
Kd
nM
EC50/IC50
nM
koff
s-1
kon
M-1s-1
pHTemp
°C
Voltage-gated L-type calcium channel alpha-1C subunit
(Oryctolagus cuniculus)
BDBM50317832
(3-methyl 5-(4-phenylbutyl)2,6-dimethyl-4-(3-nitrop...)
Show SMILES COC(=O)C1C(C(C(=O)OCCCCc2ccccc2)=C(C)N=C1C)c1cccc(c1)[N+]([O-])=O |c:23,t:20|
Show InChI InChI=1S/C26H28N2O6/c1-17-22(25(29)33-3)24(20-13-9-14-21(16-20)28(31)32)23(18(2)27-17)26(30)34-15-8-7-12-19-10-5-4-6-11-19/h4-6,9-11,13-14,16,22,24H,7-8,12,15H2,1-3H3
Reactome pathway
n/an/a 10n/an/an/an/an/an/a
Northwestern University
Curated by ChEMBL
Assay Description
Antagonist activity at rabbit Cav1.2 expressed in HEK293 cells assessed as inhibition of voltage pulse-induced calcium current by FLIPR calcium 4 ass...
Bioorg Med Chem 18: 3147-58 (2010)
Article DOI: 10.1016/j.bmc.2010.03.038
BindingDB Entry DOI: 10.7270/Q2F47P90
Cav1.3/Cav beta3/Cav alpha2delta complex
(Rattus norvegicus)
BDBM50317832
(3-methyl 5-(4-phenylbutyl)2,6-dimethyl-4-(3-nitrop...)
Show SMILES COC(=O)C1C(C(C(=O)OCCCCc2ccccc2)=C(C)N=C1C)c1cccc(c1)[N+]([O-])=O |c:23,t:20|
Show InChI InChI=1S/C26H28N2O6/c1-17-22(25(29)33-3)24(20-13-9-14-21(16-20)28(31)32)23(18(2)27-17)26(30)34-15-8-7-12-19-10-5-4-6-11-19/h4-6,9-11,13-14,16,22,24H,7-8,12,15H2,1-3H3
Reactome pathway
n/an/a 38n/an/an/an/an/an/a
Northwestern University
Curated by ChEMBL
Assay Description
Antagonist activity at rat Cav1.3 expressed in HEK293 cells assessed as inhibition of voltage pulse-induced calcium current by FLIPR calcium 4 assay
Bioorg Med Chem 18: 3147-58 (2010)
Article DOI: 10.1016/j.bmc.2010.03.038
BindingDB Entry DOI: 10.7270/Q2F47P90