BDBM50317836 3-methyl 5-(3-phenoxypropyl)2,6-dimethyl-4-(3-nitrophenyl)-1,4-dihydropyridine-3,5-dicarboxylate::CHEMBL1098871
SMILES: COC(=O)C1C(C(C(=O)OCCCOc2ccccc2)=C(C)N=C1C)c1cccc(c1)[N+]([O-])=O
InChI Key: InChIKey=KGGBFBDAZHLTNB-UHFFFAOYSA-N
Data: 2 IC50
Activity Spreadsheet -- Enzyme Inhibition Constant Data from BindingDB
Found 2 hits for monomerid = 50317836
Trg + Lig
Ki
nM
ΔG°
kcal/mole
IC50
nM
Kd
nM
EC50/IC50
nM
koff
s-1
kon
M-1s-1
pHTemp
°C
Voltage-gated L-type calcium channel alpha-1C subunit
(Oryctolagus cuniculus)
BDBM50317836
(3-methyl 5-(3-phenoxypropyl)2,6-dimethyl-4-(3-nitr...)
Show SMILES COC(=O)C1C(C(C(=O)OCCCOc2ccccc2)=C(C)N=C1C)c1cccc(c1)[N+]([O-])=O |c:23,t:20|
Show InChI InChI=1S/C25H26N2O7/c1-16-21(24(28)32-3)23(18-9-7-10-19(15-18)27(30)31)22(17(2)26-16)25(29)34-14-8-13-33-20-11-5-4-6-12-20/h4-7,9-12,15,21,23H,8,13-14H2,1-3H3
Reactome pathway
n/an/a 9n/an/an/an/an/an/a
Northwestern University
Curated by ChEMBL
Assay Description
Antagonist activity at rabbit Cav1.2 expressed in HEK293 cells assessed as inhibition of voltage pulse-induced calcium current by FLIPR calcium 4 ass...
Bioorg Med Chem 18: 3147-58 (2010)
Article DOI: 10.1016/j.bmc.2010.03.038
BindingDB Entry DOI: 10.7270/Q2F47P90
Cav1.3/Cav beta3/Cav alpha2delta complex
(Rattus norvegicus)
BDBM50317836
(3-methyl 5-(3-phenoxypropyl)2,6-dimethyl-4-(3-nitr...)
Show SMILES COC(=O)C1C(C(C(=O)OCCCOc2ccccc2)=C(C)N=C1C)c1cccc(c1)[N+]([O-])=O |c:23,t:20|
Show InChI InChI=1S/C25H26N2O7/c1-16-21(24(28)32-3)23(18-9-7-10-19(15-18)27(30)31)22(17(2)26-16)25(29)34-14-8-13-33-20-11-5-4-6-12-20/h4-7,9-12,15,21,23H,8,13-14H2,1-3H3
Reactome pathway
n/an/a 11n/an/an/an/an/an/a
Northwestern University
Curated by ChEMBL
Assay Description
Antagonist activity at rat Cav1.3 expressed in HEK293 cells assessed as inhibition of voltage pulse-induced calcium current by FLIPR calcium 4 assay
Bioorg Med Chem 18: 3147-58 (2010)
Article DOI: 10.1016/j.bmc.2010.03.038
BindingDB Entry DOI: 10.7270/Q2F47P90