BDBM50318098 1-Phenyl-8-(phenylamino)-4,5-dihydro-1H-pyrazolo[4,3-h]-quinazoline-3-carboxamide::CHEMBL1094400
SMILES: NC(=O)c1nn(c-2c1CCc1cnc(Nc3ccccc3)nc-21)-c1ccccc1
InChI Key: InChIKey=KGLRLXMTNCPNET-UHFFFAOYSA-N
Data: 3 IC50
Activity Spreadsheet -- Enzyme Inhibition Constant Data from BindingDB
Found 3 hits for monomerid = 50318098
Trg + Lig
Ki
nM
ΔG°
kcal/mole
IC50
nM
Kd
nM
EC50/IC50
nM
koff
s-1
kon
M-1s-1
pHTemp
°C
CDK2/Cyclin A/Cyclin A1
(Homo sapiens (Human))
BDBM50318098
(1-Phenyl-8-(phenylamino)-4,5-dihydro-1H-pyrazolo[4...)
Show SMILES NC(=O)c1nn(c-2c1CCc1cnc(Nc3ccccc3)nc-21)-c1ccccc1
Show InChI InChI=1S/C22H18N6O/c23-21(29)19-17-12-11-14-13-24-22(25-15-7-3-1-4-8-15)26-18(14)20(17)28(27-19)16-9-5-2-6-10-16/h1-10,13H,11-12H2,(H2,23,29)(H,24,25,26)
Reactome pathway
n/an/a 15n/an/an/an/an/an/a
Nerviano Medical Sciences Srl
Curated by ChEMBL
Assay Description
Inhibition of CDK2/Cyclin A assessed as [33P]gamma-ATP incorporation into substrate after 60 mins by gamma counting
J Med Chem 53: 3532-51 (2010)
Article DOI: 10.1021/jm901713n
BindingDB Entry DOI: 10.7270/Q2RF5V5D
Serine/threonine-protein kinase PLK1
(Homo sapiens (Human))
BDBM50318098
(1-Phenyl-8-(phenylamino)-4,5-dihydro-1H-pyrazolo[4...)
Show SMILES NC(=O)c1nn(c-2c1CCc1cnc(Nc3ccccc3)nc-21)-c1ccccc1
Show InChI InChI=1S/C22H18N6O/c23-21(29)19-17-12-11-14-13-24-22(25-15-7-3-1-4-8-15)26-18(14)20(17)28(27-19)16-9-5-2-6-10-16/h1-10,13H,11-12H2,(H2,23,29)(H,24,25,26)
NCI pathway
Reactome pathway
n/an/a>1.00E+4n/an/an/an/an/an/a
Nerviano Medical Sciences Srl
Curated by ChEMBL
Assay Description
Inhibition of GST-tagged PLK1 expressed in H5 insect cells assessed as [33P]gamma-ATP incorporation into substrate after 60 mins by gamma counting
J Med Chem 53: 3532-51 (2010)
Article DOI: 10.1021/jm901713n
BindingDB Entry DOI: 10.7270/Q2RF5V5D
Aurora kinase A
(Homo sapiens (Human))
BDBM50318098
(1-Phenyl-8-(phenylamino)-4,5-dihydro-1H-pyrazolo[4...)
Show SMILES NC(=O)c1nn(c-2c1CCc1cnc(Nc3ccccc3)nc-21)-c1ccccc1
Show InChI InChI=1S/C22H18N6O/c23-21(29)19-17-12-11-14-13-24-22(25-15-7-3-1-4-8-15)26-18(14)20(17)28(27-19)16-9-5-2-6-10-16/h1-10,13H,11-12H2,(H2,23,29)(H,24,25,26)
NCI pathway
Reactome pathway
n/an/a 2.36E+3n/an/an/an/an/an/a
Nerviano Medical Sciences Srl
Curated by ChEMBL
Assay Description
Inhibition of Aurora A assessed as [33P]gamma-ATP incorporation into substrate after 60 mins by gamma counting
J Med Chem 53: 3532-51 (2010)
Article DOI: 10.1021/jm901713n
BindingDB Entry DOI: 10.7270/Q2RF5V5D