BDBM50318470 1-(6-fluoropyridin-3-yl)-2-methylpent-1-en-3-one oxime::CHEMBL1085708
SMILES: CCC(N=O)C(C)=Cc1ccc(F)nc1
InChI Key: InChIKey=ODLSADWQKBSESE-UHFFFAOYSA-N
Data: 1 IC50
Activity Spreadsheet -- Enzyme Inhibition Constant Data from BindingDB
Found 1 hit for monomerid = 50318470
Trg + Lig
Ki
nM
ΔG°
kcal/mole
IC50
nM
Kd
nM
EC50/IC50
nM
koff
s-1
kon
M-1s-1
pHTemp
°C
Transient receptor potential cation channel subfamily A member 1
(Homo sapiens (Human))
BDBM50318470
(1-(6-fluoropyridin-3-yl)-2-methylpent-1-en-3-one o...)
Show SMILES CCC(N=O)C(C)=Cc1ccc(F)nc1 |w:7.7|
Show InChI InChI=1S/C11H13FN2O/c1-3-10(14-15)8(2)6-9-4-5-11(12)13-7-9/h4-7,10H,3H2,1-2H3
n/an/a 1.25E+3n/an/an/an/an/an/a
Ferrara University
Curated by ChEMBL
Assay Description
Antagonist activity at human TRPA1 channel expressed in CHO cells assessed as inhibition of cinnamaldehyde-induced intracellular calcium influx
J Med Chem 53: 5085-107 (2010)
Article DOI: 10.1021/jm100062h
BindingDB Entry DOI: 10.7270/Q2416Z02