BDBM50318517 2-methyl-1-(quinolin-3-yl)pent-1-en-3-one oxime::CHEMBL1084374
SMILES: CCC(N=O)C(C)=Cc1cnc2ccccc2c1
InChI Key: InChIKey=JXZFSSIAYUVTDT-UHFFFAOYSA-N
Data: 1 IC50
Activity Spreadsheet -- Enzyme Inhibition Constant Data from BindingDB
Found 1 hit for monomerid = 50318517
Trg + Lig
Ki
nM
ΔG°
kcal/mole
IC50
nM
Kd
nM
EC50/IC50
nM
koff
s-1
kon
M-1s-1
pHTemp
°C
Transient receptor potential cation channel subfamily A member 1
(Homo sapiens (Human))
BDBM50318517
(2-methyl-1-(quinolin-3-yl)pent-1-en-3-one oxime | ...)
Show SMILES CCC(N=O)C(C)=Cc1cnc2ccccc2c1 |w:7.7|
Show InChI InChI=1S/C15H16N2O/c1-3-14(17-18)11(2)8-12-9-13-6-4-5-7-15(13)16-10-12/h4-10,14H,3H2,1-2H3
n/an/a>1.00E+5n/an/an/an/an/an/a
Ferrara University
Curated by ChEMBL
Assay Description
Antagonist activity at human TRPA1 channel expressed in CHO cells assessed as inhibition of cinnamaldehyde-induced intracellular calcium influx
J Med Chem 53: 5085-107 (2010)
Article DOI: 10.1021/jm100062h
BindingDB Entry DOI: 10.7270/Q2416Z02