BDBM50318518 2-methyl-1-(4-methylpyridin-3-yl)pent-1-en-3-one oxime::CHEMBL1083489
SMILES: CCC(N=O)C(C)=Cc1cnccc1C
InChI Key: InChIKey=JDRRNAOVXUPCMU-UHFFFAOYSA-N
Data: 1 IC50
Activity Spreadsheet -- Enzyme Inhibition Constant Data from BindingDB
Found 1 hit for monomerid = 50318518
Trg + Lig
Ki
nM
ΔG°
kcal/mole
IC50
nM
Kd
nM
EC50/IC50
nM
koff
s-1
kon
M-1s-1
pHTemp
°C
Transient receptor potential cation channel subfamily A member 1
(Homo sapiens (Human))
BDBM50318518
(2-methyl-1-(4-methylpyridin-3-yl)pent-1-en-3-one o...)
Show SMILES CCC(N=O)C(C)=Cc1cnccc1C |w:7.7|
Show InChI InChI=1S/C12H16N2O/c1-4-12(14-15)10(3)7-11-8-13-6-5-9(11)2/h5-8,12H,4H2,1-3H3
n/an/a>1.00E+5n/an/an/an/an/an/a
Ferrara University
Curated by ChEMBL
Assay Description
Antagonist activity at human TRPA1 channel expressed in CHO cells assessed as inhibition of cinnamaldehyde-induced intracellular calcium influx
J Med Chem 53: 5085-107 (2010)
Article DOI: 10.1021/jm100062h
BindingDB Entry DOI: 10.7270/Q2416Z02