BDBM50318538 Ac-AR-(N-Me)A-NH2::CHEMBL1084620
SMILES: [#6]-[#6@H](-[#7]-[#6](-[#6])=O)-[#6](=O)-[#7]-[#6@@H](-[#6]-[#6]-[#6]\[#7]=[#6](/[#7])-[#7])-[#6](=O)-[#7](-[#6])-[#6@@H](-[#6])-[#6](-[#7])=O
InChI Key: InChIKey=YQYYSSWBEIIDLB-QXEWZRGKSA-N
Data: 1 KI  1 IC50
Activity Spreadsheet -- Enzyme Inhibition Constant Data from BindingDB
Found 2 hits for monomerid = 50318538
Trg + Lig
Ki
nM
ΔG°
kcal/mole
IC50
nM
Kd
nM
EC50/IC50
nM
koff
s-1
kon
M-1s-1
pHTemp
°C
WD repeat-containing protein 5 (WDR5)
(Homo sapiens (Human))
BDBM50318538
(Ac-AR-(N-Me)A-NH2 | CHEMBL1084620)
Show SMILES [#6]-[#6@H](-[#7]-[#6](-[#6])=O)-[#6](=O)-[#7]-[#6@@H](-[#6]-[#6]-[#6]\[#7]=[#6](/[#7])-[#7])-[#6](=O)-[#7](-[#6])-[#6@@H](-[#6])-[#6](-[#7])=O |r|
Show InChI InChI=1S/C15H29N7O4/c1-8(20-10(3)23)13(25)21-11(6-5-7-19-15(17)18)14(26)22(4)9(2)12(16)24/h8-9,11H,5-7H2,1-4H3,(H2,16,24)(H,20,23)(H,21,25)(H4,17,18,19)/t8-,9-,11-/m0/s1
>5.00E+4n/an/an/an/an/an/an/an/a
University of Michigan
Curated by ChEMBL
Assay Description
Binding affinity to WDR5 expressed in pLysS cells by optimized fluorescent polarization based competitive binding assay
J Med Chem 53: 5179-85 (2010)
Article DOI: 10.1021/jm100139b
BindingDB Entry DOI: 10.7270/Q2086678
WD repeat-containing protein 5 (WDR5)
(Homo sapiens (Human))
BDBM50318538
(Ac-AR-(N-Me)A-NH2 | CHEMBL1084620)
Show SMILES [#6]-[#6@H](-[#7]-[#6](-[#6])=O)-[#6](=O)-[#7]-[#6@@H](-[#6]-[#6]-[#6]\[#7]=[#6](/[#7])-[#7])-[#6](=O)-[#7](-[#6])-[#6@@H](-[#6])-[#6](-[#7])=O |r|
Show InChI InChI=1S/C15H29N7O4/c1-8(20-10(3)23)13(25)21-11(6-5-7-19-15(17)18)14(26)22(4)9(2)12(16)24/h8-9,11H,5-7H2,1-4H3,(H2,16,24)(H,20,23)(H,21,25)(H4,17,18,19)/t8-,9-,11-/m0/s1
n/an/a>3.00E+5n/an/an/an/an/an/a
University of Michigan
Curated by ChEMBL
Assay Description
Binding affinity to WDR5 expressed in pLysS cells by optimized fluorescent polarization based competitive binding assay
J Med Chem 53: 5179-85 (2010)
Article DOI: 10.1021/jm100139b
BindingDB Entry DOI: 10.7270/Q2086678