BDBM50318547 Ac-ARAE-NH2::CHEMBL1085604
SMILES: [#6]-[#6@H](-[#7]-[#6](-[#6])=O)-[#6](=O)-[#7]-[#6@@H](-[#6]-[#6]-[#6]\[#7]=[#6](/[#7])-[#7])-[#6](=O)-[#7]-[#6@@H](-[#6])-[#6](=O)-[#7]-[#6@@H](-[#6]-[#6]-[#6](-[#8])=O)-[#6](-[#7])=O
InChI Key: InChIKey=ZFNWHWJOGHVTEW-UKJIMTQDSA-N
Data: 1 KI  1 IC50
Activity Spreadsheet -- Enzyme Inhibition Constant Data from BindingDB
Found 2 hits for monomerid = 50318547
Trg + Lig
Ki
nM
ΔG°
kcal/mole
IC50
nM
Kd
nM
EC50/IC50
nM
koff
s-1
kon
M-1s-1
pHTemp
°C
WD repeat-containing protein 5 (WDR5)
(Homo sapiens (Human))
BDBM50318547
(Ac-ARAE-NH2 | CHEMBL1085604)
Show SMILES [#6]-[#6@H](-[#7]-[#6](-[#6])=O)-[#6](=O)-[#7]-[#6@@H](-[#6]-[#6]-[#6]\[#7]=[#6](/[#7])-[#7])-[#6](=O)-[#7]-[#6@@H](-[#6])-[#6](=O)-[#7]-[#6@@H](-[#6]-[#6]-[#6](-[#8])=O)-[#6](-[#7])=O |r|
Show InChI InChI=1S/C19H34N8O7/c1-9(24-11(3)28)16(32)27-13(5-4-8-23-19(21)22)18(34)25-10(2)17(33)26-12(15(20)31)6-7-14(29)30/h9-10,12-13H,4-8H2,1-3H3,(H2,20,31)(H,24,28)(H,25,34)(H,26,33)(H,27,32)(H,29,30)(H4,21,22,23)/t9-,10-,12-,13-/m0/s1
80n/an/an/an/an/an/an/an/a
University of Michigan
Curated by ChEMBL
Assay Description
Binding affinity to WDR5 expressed in pLysS cells by optimized fluorescent polarization based competitive binding assay
J Med Chem 53: 5179-85 (2010)
Article DOI: 10.1021/jm100139b
BindingDB Entry DOI: 10.7270/Q2086678
WD repeat-containing protein 5 (WDR5)
(Homo sapiens (Human))
BDBM50318547
(Ac-ARAE-NH2 | CHEMBL1085604)
Show SMILES [#6]-[#6@H](-[#7]-[#6](-[#6])=O)-[#6](=O)-[#7]-[#6@@H](-[#6]-[#6]-[#6]\[#7]=[#6](/[#7])-[#7])-[#6](=O)-[#7]-[#6@@H](-[#6])-[#6](=O)-[#7]-[#6@@H](-[#6]-[#6]-[#6](-[#8])=O)-[#6](-[#7])=O |r|
Show InChI InChI=1S/C19H34N8O7/c1-9(24-11(3)28)16(32)27-13(5-4-8-23-19(21)22)18(34)25-10(2)17(33)26-12(15(20)31)6-7-14(29)30/h9-10,12-13H,4-8H2,1-3H3,(H2,20,31)(H,24,28)(H,25,34)(H,26,33)(H,27,32)(H,29,30)(H4,21,22,23)/t9-,10-,12-,13-/m0/s1
n/an/a 400n/an/an/an/an/an/a
University of Michigan
Curated by ChEMBL
Assay Description
Binding affinity to WDR5 expressed in pLysS cells by optimized fluorescent polarization based competitive binding assay
J Med Chem 53: 5179-85 (2010)
Article DOI: 10.1021/jm100139b
BindingDB Entry DOI: 10.7270/Q2086678