BDBM50318568 2-(4-(6-Cyclopropyl-2-(4-methoxyphenyl)-3H-imidazo[4,5-b]pyridin-7-yl)piperazin-1-yl)-N-(thiazol-2-yl)acetamide::CHEMBL1085357
SMILES: COc1ccc(cc1)-c1nc2ncc(C3CC3)c(N3CCN(CC(=O)Nc4nccs4)CC3)c2[nH]1
InChI Key: InChIKey=AXFARURNJIJQNK-UHFFFAOYSA-N
Data: 2 IC50
Activity Spreadsheet -- Enzyme Inhibition Constant Data from BindingDB
Found 2 hits for monomerid = 50318568
Trg + Lig
Ki
nM
ΔG°
kcal/mole
IC50
nM
Kd
nM
EC50/IC50
nM
koff
s-1
kon
M-1s-1
pHTemp
°C
Aurora kinase A
(Homo sapiens (Human))
BDBM50318568
(2-(4-(6-Cyclopropyl-2-(4-methoxyphenyl)-3H-imidazo...)
Show SMILES COc1ccc(cc1)-c1nc2ncc(C3CC3)c(N3CCN(CC(=O)Nc4nccs4)CC3)c2[nH]1
Show InChI InChI=1S/C25H27N7O2S/c1-34-18-6-4-17(5-7-18)23-29-21-22(19(16-2-3-16)14-27-24(21)30-23)32-11-9-31(10-12-32)15-20(33)28-25-26-8-13-35-25/h4-8,13-14,16H,2-3,9-12,15H2,1H3,(H,26,28,33)(H,27,29,30)
NCI pathway
Reactome pathway
n/an/a 53n/an/an/an/an/an/a
Institute of Cancer Research
Curated by ChEMBL
Assay Description
Inhibition of human recombinant Aurora A expressed in baculovirus system
J Med Chem 53: 5213-28 (2010)
Article DOI: 10.1021/jm100262j
BindingDB Entry DOI: 10.7270/Q2GB251P
Aurora kinase A
(Homo sapiens (Human))
BDBM50318568
(2-(4-(6-Cyclopropyl-2-(4-methoxyphenyl)-3H-imidazo...)
Show SMILES COc1ccc(cc1)-c1nc2ncc(C3CC3)c(N3CCN(CC(=O)Nc4nccs4)CC3)c2[nH]1
Show InChI InChI=1S/C25H27N7O2S/c1-34-18-6-4-17(5-7-18)23-29-21-22(19(16-2-3-16)14-27-24(21)30-23)32-11-9-31(10-12-32)15-20(33)28-25-26-8-13-35-25/h4-8,13-14,16H,2-3,9-12,15H2,1H3,(H,26,28,33)(H,27,29,30)
NCI pathway
Reactome pathway
n/an/a 53n/an/an/an/an/an/a
Jinan University
Curated by ChEMBL
Assay Description
Inhibition of Aurora A
Eur J Med Chem 46: 77-94 (2010)
Article DOI: 10.1016/j.ejmech.2010.10.017
BindingDB Entry DOI: 10.7270/Q25X296N