BDBM50319019 4-(5-(4-methoxybenzyl)-3-methylbenzo[b]thiophen-2-yl)pyrimidin-2-amine::CHEMBL1086545
SMILES: COc1ccc(Cc2ccc3sc(c(C)c3c2)-c2ccnc(N)n2)cc1
InChI Key: InChIKey=WATJUDKMSCNCAN-UHFFFAOYSA-N
Data: 1 IC50  1 EC50
Activity Spreadsheet -- Enzyme Inhibition Constant Data from BindingDB
Found 2 hits for monomerid = 50319019
Trg + Lig
Ki
nM
ΔG°
kcal/mole
IC50
nM
Kd
nM
EC50/IC50
nM
koff
s-1
kon
M-1s-1
pHTemp
°C
Rho-associated protein kinase 1
(Homo sapiens (Human))
BDBM50319019
(4-(5-(4-methoxybenzyl)-3-methylbenzo[b]thiophen-2-...)
Show SMILES COc1ccc(Cc2ccc3sc(c(C)c3c2)-c2ccnc(N)n2)cc1
Show InChI InChI=1S/C21H19N3OS/c1-13-17-12-15(11-14-3-6-16(25-2)7-4-14)5-8-19(17)26-20(13)18-9-10-23-21(22)24-18/h3-10,12H,11H2,1-2H3,(H2,22,23,24)
NCI pathway
Reactome pathway
n/an/an/an/a>1.00E+4n/an/an/an/a
Kalypsys, Inc.
Curated by ChEMBL
Assay Description
Inhibition of ROCK1 in human GTM3 cells by impedance assay
Bioorg Med Chem Lett 20: 3361-6 (2010)
Article DOI: 10.1016/j.bmcl.2010.04.020
BindingDB Entry DOI: 10.7270/Q289161H
Rho-associated protein kinase 1
(Homo sapiens (Human))
BDBM50319019
(4-(5-(4-methoxybenzyl)-3-methylbenzo[b]thiophen-2-...)
Show SMILES COc1ccc(Cc2ccc3sc(c(C)c3c2)-c2ccnc(N)n2)cc1
Show InChI InChI=1S/C21H19N3OS/c1-13-17-12-15(11-14-3-6-16(25-2)7-4-14)5-8-19(17)26-20(13)18-9-10-23-21(22)24-18/h3-10,12H,11H2,1-2H3,(H2,22,23,24)
NCI pathway
Reactome pathway
n/an/a 7.20E+3n/an/an/an/an/an/a
Kalypsys, Inc.
Curated by ChEMBL
Assay Description
Inhibition of ROCK1 assessed as ATP cunsumption
Bioorg Med Chem Lett 20: 3361-6 (2010)
Article DOI: 10.1016/j.bmcl.2010.04.020
BindingDB Entry DOI: 10.7270/Q289161H