BDBM50319151 3,4-Dimethyl-8-methoxy-1-pentyl-imidazo[1,5-a]pyrido[3,2-e]pyrazine::CHEMBL1085646
SMILES: CCCCCc1nc(C)c2c(C)nc3ccc(OC)nc3n12
InChI Key: InChIKey=MFMGRWBSTBLPCH-UHFFFAOYSA-N
Data: 1 IC50
Activity Spreadsheet -- Enzyme Inhibition Constant Data from BindingDB
Found 1 hit for monomerid = 50319151
Trg + Lig
Ki
nM
ΔG°
kcal/mole
IC50
nM
Kd
nM
EC50/IC50
nM
koff
s-1
kon
M-1s-1
pHTemp
°C
cAMP and cAMP-inhibited cGMP 3',5'-cyclic phosphodiesterase 10A
(Homo sapiens (Human))
BDBM50319151
(3,4-Dimethyl-8-methoxy-1-pentyl-imidazo[1,5-a]pyri...)
Show SMILES CCCCCc1nc(C)c2c(C)nc3ccc(OC)nc3n12
Show InChI InChI=1S/C17H22N4O/c1-5-6-7-8-14-19-12(3)16-11(2)18-13-9-10-15(22-4)20-17(13)21(14)16/h9-10H,5-8H2,1-4H3
Reactome pathway
n/an/a 51n/an/an/an/an/an/a
Biotie Therapies GmbH
Curated by ChEMBL
Assay Description
Inhibition of human recombinant PDE10A expressed in baculovirus-SF21 cell system assessed as hydrolysis of [3H]cAMP after 1 hr by liquid scintillatio...
J Med Chem 53: 4399-411 (2010)
Article DOI: 10.1021/jm1002793
BindingDB Entry DOI: 10.7270/Q2MK6D3N