BDBM50319167 3,4-Dimethyl-1-ethyl-8-methoxy-imidazo[1,5-a]pyrido[3,2-e]pyrazine::CHEMBL1084447
SMILES: CCc1nc(C)c2c(C)nc3ccc(OC)nc3n12
InChI Key: InChIKey=WMPKDTHKWZGIRF-UHFFFAOYSA-N
Data: 1 IC50
Activity Spreadsheet -- Enzyme Inhibition Constant Data from BindingDB
Found 1 hit for monomerid = 50319167
Trg + Lig
Ki
nM
ΔG°
kcal/mole
IC50
nM
Kd
nM
EC50/IC50
nM
koff
s-1
kon
M-1s-1
pHTemp
°C
cAMP and cAMP-inhibited cGMP 3',5'-cyclic phosphodiesterase 10A
(Homo sapiens (Human))
BDBM50319167
(3,4-Dimethyl-1-ethyl-8-methoxy-imidazo[1,5-a]pyrid...)
Show SMILES CCc1nc(C)c2c(C)nc3ccc(OC)nc3n12
Show InChI InChI=1S/C14H16N4O/c1-5-11-16-9(3)13-8(2)15-10-6-7-12(19-4)17-14(10)18(11)13/h6-7H,5H2,1-4H3
Reactome pathway
n/an/a 16n/an/an/an/an/an/a
Biotie Therapies GmbH
Curated by ChEMBL
Assay Description
Inhibition of human recombinant PDE10A expressed in baculovirus-SF21 cell system assessed as hydrolysis of [3H]cAMP after 1 hr by liquid scintillatio...
J Med Chem 53: 4399-411 (2010)
Article DOI: 10.1021/jm1002793
BindingDB Entry DOI: 10.7270/Q2MK6D3N