BDBM50319188 8-Methoxy-1,3-dimethyl-4-methylsulfanyl-imidazo[1,5-a]pyrido-[3,2-e]pyrazine::CHEMBL1084004
SMILES: COc1ccc2nc(SC)c3c(C)nc(C)n3c2n1
InChI Key: InChIKey=WEEBUMPNLCNWGN-UHFFFAOYSA-N
Data: 1 IC50
Activity Spreadsheet -- Enzyme Inhibition Constant Data from BindingDB
Found 1 hit for monomerid = 50319188
Trg + Lig
Ki
nM
ΔG°
kcal/mole
IC50
nM
Kd
nM
EC50/IC50
nM
koff
s-1
kon
M-1s-1
pHTemp
°C
cAMP and cAMP-inhibited cGMP 3',5'-cyclic phosphodiesterase 10A
(Homo sapiens (Human))
BDBM50319188
(8-Methoxy-1,3-dimethyl-4-methylsulfanyl-imidazo[1,...)
Show SMILES COc1ccc2nc(SC)c3c(C)nc(C)n3c2n1
Show InChI InChI=1S/C13H14N4OS/c1-7-11-13(19-4)15-9-5-6-10(18-3)16-12(9)17(11)8(2)14-7/h5-6H,1-4H3
Reactome pathway
n/an/a 2.39E+3n/an/an/an/an/an/a
Biotie Therapies GmbH
Curated by ChEMBL
Assay Description
Inhibition of human recombinant PDE10A expressed in baculovirus-SF21 cell system assessed as hydrolysis of [3H]cAMP after 1 hr by liquid scintillatio...
J Med Chem 53: 4399-411 (2010)
Article DOI: 10.1021/jm1002793
BindingDB Entry DOI: 10.7270/Q2MK6D3N