BDBM50319202 8-Methoxy-3-methyl-4-methylamino-1-propyl-imidazo[1,5-a]-pyrido[3,2-e]pyrazine::CHEMBL1086263
SMILES: CCCc1nc(C)c2c(NC)nc3ccc(OC)nc3n12
InChI Key: InChIKey=MAOBVHVBTOQFTB-UHFFFAOYSA-N
Data: 1 IC50
Activity Spreadsheet -- Enzyme Inhibition Constant Data from BindingDB
Found 1 hit for monomerid = 50319202
Trg + Lig
Ki
nM
ΔG°
kcal/mole
IC50
nM
Kd
nM
EC50/IC50
nM
koff
s-1
kon
M-1s-1
pHTemp
°C
cAMP and cAMP-inhibited cGMP 3',5'-cyclic phosphodiesterase 10A
(Homo sapiens (Human))
BDBM50319202
(8-Methoxy-3-methyl-4-methylamino-1-propyl-imidazo[...)
Show SMILES CCCc1nc(C)c2c(NC)nc3ccc(OC)nc3n12
Show InChI InChI=1S/C15H19N5O/c1-5-6-11-17-9(2)13-14(16-3)18-10-7-8-12(21-4)19-15(10)20(11)13/h7-8H,5-6H2,1-4H3,(H,16,18)
Reactome pathway
n/an/a 246n/an/an/an/an/an/a
Biotie Therapies GmbH
Curated by ChEMBL
Assay Description
Inhibition of human recombinant PDE10A expressed in baculovirus-SF21 cell system assessed as hydrolysis of [3H]cAMP after 1 hr by liquid scintillatio...
J Med Chem 53: 4399-411 (2010)
Article DOI: 10.1021/jm1002793
BindingDB Entry DOI: 10.7270/Q2MK6D3N