BDBM50319203 8-Methoxy-3-methyl-4-phenethyloxy-1-propyl-imidazo[1,5-a]-pyrido[3,2-e]pyrazine::CHEMBL1083127
SMILES: CCCc1nc(C)c2c(OCCc3ccccc3)nc3ccc(OC)nc3n12
InChI Key: InChIKey=BCEDCYOCCOCEEY-UHFFFAOYSA-N
Data: 1 IC50
Activity Spreadsheet -- Enzyme Inhibition Constant Data from BindingDB
Found 1 hit for monomerid = 50319203
Trg + Lig
Ki
nM
ΔG°
kcal/mole
IC50
nM
Kd
nM
EC50/IC50
nM
koff
s-1
kon
M-1s-1
pHTemp
°C
cAMP and cAMP-inhibited cGMP 3',5'-cyclic phosphodiesterase 10A
(Homo sapiens (Human))
BDBM50319203
(8-Methoxy-3-methyl-4-phenethyloxy-1-propyl-imidazo...)
Show SMILES CCCc1nc(C)c2c(OCCc3ccccc3)nc3ccc(OC)nc3n12
Show InChI InChI=1S/C22H24N4O2/c1-4-8-18-23-15(2)20-22(28-14-13-16-9-6-5-7-10-16)24-17-11-12-19(27-3)25-21(17)26(18)20/h5-7,9-12H,4,8,13-14H2,1-3H3
Reactome pathway
n/an/a 383n/an/an/an/an/an/a
Biotie Therapies GmbH
Curated by ChEMBL
Assay Description
Inhibition of human recombinant PDE10A expressed in baculovirus-SF21 cell system assessed as hydrolysis of [3H]cAMP after 1 hr by liquid scintillatio...
J Med Chem 53: 4399-411 (2010)
Article DOI: 10.1021/jm1002793
BindingDB Entry DOI: 10.7270/Q2MK6D3N