BDBM50319226 6-{3-[4-(2-Diethylamino-ethylamino)-3-nitro-benzoyl]-ureido}-hexanoic acid hydroxyamide::CHEMBL1084343
SMILES: CCN(CC)CCNc1ccc(cc1[N+]([O-])=O)C(=O)NC(=O)NCCCCCC(=O)NO
InChI Key: InChIKey=BHGNECNZUHZLIY-UHFFFAOYSA-N
Data: 2 IC50
Activity Spreadsheet -- Enzyme Inhibition Constant Data from BindingDB
Found 2 hits for monomerid = 50319226
Trg + Lig
Ki
nM
ΔG°
kcal/mole
IC50
nM
Kd
nM
EC50/IC50
nM
koff
s-1
kon
M-1s-1
pHTemp
°C
Histone deacetylase 1
(Homo sapiens (Human))
BDBM50319226
(6-{3-[4-(2-Diethylamino-ethylamino)-3-nitro-benzoy...)
Show SMILES CCN(CC)CCNc1ccc(cc1[N+]([O-])=O)C(=O)NC(=O)NCCCCCC(=O)NO
Show InChI InChI=1S/C20H32N6O6/c1-3-25(4-2)13-12-21-16-10-9-15(14-17(16)26(31)32)19(28)23-20(29)22-11-7-5-6-8-18(27)24-30/h9-10,14,21,30H,3-8,11-13H2,1-2H3,(H,24,27)(H2,22,23,28,29)
NCI pathway
Reactome pathway
n/an/a 20n/an/an/an/an/an/a
S *BIO Pte Ltd
Curated by ChEMBL
Assay Description
Inhibition of HDAC1 in human COLO205 cells assessed as induction of histone H3 acetylation
Bioorg Med Chem Lett 20: 3314-21 (2010)
Article DOI: 10.1016/j.bmcl.2010.04.041
BindingDB Entry DOI: 10.7270/Q2GT5NCX
Histone deacetylase 1
(Homo sapiens (Human))
BDBM50319226
(6-{3-[4-(2-Diethylamino-ethylamino)-3-nitro-benzoy...)
Show SMILES CCN(CC)CCNc1ccc(cc1[N+]([O-])=O)C(=O)NC(=O)NCCCCCC(=O)NO
Show InChI InChI=1S/C20H32N6O6/c1-3-25(4-2)13-12-21-16-10-9-15(14-17(16)26(31)32)19(28)23-20(29)22-11-7-5-6-8-18(27)24-30/h9-10,14,21,30H,3-8,11-13H2,1-2H3,(H,24,27)(H2,22,23,28,29)
NCI pathway
Reactome pathway
n/an/a 1.70E+3n/an/an/an/an/an/a
S *BIO Pte Ltd
Curated by ChEMBL
Assay Description
Inhibition of HDAC1 in human COLO205 cells assessed as induction of histone H3 acetylation
Bioorg Med Chem Lett 20: 3314-21 (2010)
Article DOI: 10.1016/j.bmcl.2010.04.041
BindingDB Entry DOI: 10.7270/Q2GT5NCX