BDBM50319279 1-(3-(4-(5-fluoro-4-methyl-1H-benzo[d]imidazol-2-yl)-3-methylphenoxy)propyl)-N-methylpyrrolidin-3-amine::CHEMBL1082772
SMILES: CNC1CCN(CCCOc2ccc(-c3nc4ccc(F)c(C)c4[nH]3)c(C)c2)C1
InChI Key: InChIKey=VQKSVUVAYXONBW-UHFFFAOYSA-N
Data: 1 KI  1 EC50
Activity Spreadsheet -- Enzyme Inhibition Constant Data from BindingDB
Found 2 hits for monomerid = 50319279
Trg + Lig
Ki
nM
ΔG°
kcal/mole
IC50
nM
Kd
nM
EC50/IC50
nM
koff
s-1
kon
M-1s-1
pHTemp
°C
Histamine H4 receptor
(Homo sapiens (Human))
BDBM50319279
(1-(3-(4-(5-fluoro-4-methyl-1H-benzo[d]imidazol-2-y...)
Show SMILES CNC1CCN(CCCOc2ccc(-c3nc4ccc(F)c(C)c4[nH]3)c(C)c2)C1
Show InChI InChI=1S/C23H29FN4O/c1-15-13-18(29-12-4-10-28-11-9-17(14-28)25-3)5-6-19(15)23-26-21-8-7-20(24)16(2)22(21)27-23/h5-8,13,17,25H,4,9-12,14H2,1-3H3,(H,26,27)
Reactome pathway
20n/an/an/an/an/an/an/an/a
Johnson& Johnson Pharmaceutical Research& Development
Curated by ChEMBL
Assay Description
Displacement of [3H]histamine from human recombinant histamine H4 receptor
Bioorg Med Chem Lett 20: 3367-71 (2010)
Article DOI: 10.1016/j.bmcl.2010.04.017
BindingDB Entry DOI: 10.7270/Q23J3D4Z
Histamine H4 receptor
(Homo sapiens (Human))
BDBM50319279
(1-(3-(4-(5-fluoro-4-methyl-1H-benzo[d]imidazol-2-y...)
Show SMILES CNC1CCN(CCCOc2ccc(-c3nc4ccc(F)c(C)c4[nH]3)c(C)c2)C1
Show InChI InChI=1S/C23H29FN4O/c1-15-13-18(29-12-4-10-28-11-9-17(14-28)25-3)5-6-19(15)23-26-21-8-7-20(24)16(2)22(21)27-23/h5-8,13,17,25H,4,9-12,14H2,1-3H3,(H,26,27)
Reactome pathway
n/an/an/an/a 62n/an/an/an/a
Johnson& Johnson Pharmaceutical Research& Development
Curated by ChEMBL
Assay Description
Agonist activity at human histamine H4 receptor in SK-N-MC cells assessed as forskolin-stimulated cAMP release preincubated for 10 mins before forsko...
Bioorg Med Chem Lett 20: 3367-71 (2010)
Article DOI: 10.1016/j.bmcl.2010.04.017
BindingDB Entry DOI: 10.7270/Q23J3D4Z