BDBM50319293 (+/-)-5-fluoro-4-methyl-2-(2-methyl-4-(3-(6-methyl-3,6-diazabicyclo[3.1.0]hexan-3-yl)propoxy)phenyl)-1H-benzo[d]imidazole::CHEMBL1086038
SMILES: CN1C2CN(CCCOc3ccc(-c4nc5ccc(F)c(C)c5[nH]4)c(C)c3)CC12
InChI Key: InChIKey=SDOQBCOFSSDBJV-UHFFFAOYSA-N
Data: 1 KI  1 EC50
Activity Spreadsheet -- Enzyme Inhibition Constant Data from BindingDB
Found 2 hits for monomerid = 50319293
Trg + Lig
Ki
nM
ΔG°
kcal/mole
IC50
nM
Kd
nM
EC50/IC50
nM
koff
s-1
kon
M-1s-1
pHTemp
°C
Histamine H4 receptor
(Homo sapiens (Human))
BDBM50319293
((+/-)-5-fluoro-4-methyl-2-(2-methyl-4-(3-(6-methyl...)
Show SMILES CN1C2CN(CCCOc3ccc(-c4nc5ccc(F)c(C)c5[nH]4)c(C)c3)CC12
Show InChI InChI=1S/C23H27FN4O/c1-14-11-16(29-10-4-9-28-12-20-21(13-28)27(20)3)5-6-17(14)23-25-19-8-7-18(24)15(2)22(19)26-23/h5-8,11,20-21H,4,9-10,12-13H2,1-3H3,(H,25,26)
Reactome pathway
89n/an/an/an/an/an/an/an/a
Johnson& Johnson Pharmaceutical Research& Development
Curated by ChEMBL
Assay Description
Displacement of [3H]histamine from human recombinant histamine H4 receptor
Bioorg Med Chem Lett 20: 3367-71 (2010)
Article DOI: 10.1016/j.bmcl.2010.04.017
BindingDB Entry DOI: 10.7270/Q23J3D4Z
Histamine H4 receptor
(Homo sapiens (Human))
BDBM50319293
((+/-)-5-fluoro-4-methyl-2-(2-methyl-4-(3-(6-methyl...)
Show SMILES CN1C2CN(CCCOc3ccc(-c4nc5ccc(F)c(C)c5[nH]4)c(C)c3)CC12
Show InChI InChI=1S/C23H27FN4O/c1-14-11-16(29-10-4-9-28-12-20-21(13-28)27(20)3)5-6-17(14)23-25-19-8-7-18(24)15(2)22(19)26-23/h5-8,11,20-21H,4,9-10,12-13H2,1-3H3,(H,25,26)
Reactome pathway
n/an/an/an/a>1.00E+4n/an/an/an/a
Johnson& Johnson Pharmaceutical Research& Development
Curated by ChEMBL
Assay Description
Agonist activity at human histamine H4 receptor in SK-N-MC cells assessed as forskolin-stimulated cAMP release preincubated for 10 mins before forsko...
Bioorg Med Chem Lett 20: 3367-71 (2010)
Article DOI: 10.1016/j.bmcl.2010.04.017
BindingDB Entry DOI: 10.7270/Q23J3D4Z