BDBM50319577 3-[3-(2-Fluorophenyl)-2,2-dioxido-2,1,3-benzothiadiazol-1(3H)-yl]-N-methylpropan-1-amine::CHEMBL1085338
SMILES: CNCCCN1c2ccccc2N(c2ccccc2F)S1(=O)=O
InChI Key: InChIKey=MFTRIVHFDLRKDH-UHFFFAOYSA-N
Data: 3 IC50
Activity Spreadsheet -- Enzyme Inhibition Constant Data from BindingDB
Found 3 hits for monomerid = 50319577
Trg + Lig
Ki
nM
ΔG°
kcal/mole
IC50
nM
Kd
nM
EC50/IC50
nM
koff
s-1
kon
M-1s-1
pHTemp
°C
Sodium-dependent noradrenaline transporter
(Homo sapiens (Human))
BDBM50319577
(3-[3-(2-Fluorophenyl)-2,2-dioxido-2,1,3-benzothiad...)
Show SMILES CNCCCN1c2ccccc2N(c2ccccc2F)S1(=O)=O
Show InChI InChI=1S/C16H18FN3O2S/c1-18-11-6-12-19-15-9-4-5-10-16(15)20(23(19,21)22)14-8-3-2-7-13(14)17/h2-5,7-10,18H,6,11-12H2,1H3
Reactome pathway
n/an/a 1n/an/an/an/an/an/a
Pfizer Global Research& Development
Curated by ChEMBL
Assay Description
Inhibition of human NET-mediated norepinephrine uptake in MDCK-Net6 cells
J Med Chem 53: 4511-21 (2010)
Article DOI: 10.1021/jm100053t
BindingDB Entry DOI: 10.7270/Q2PC32JR
Sodium-dependent dopamine transporter
(Homo sapiens (Human))
BDBM50319577
(3-[3-(2-Fluorophenyl)-2,2-dioxido-2,1,3-benzothiad...)
Show SMILES CNCCCN1c2ccccc2N(c2ccccc2F)S1(=O)=O
Show InChI InChI=1S/C16H18FN3O2S/c1-18-11-6-12-19-15-9-4-5-10-16(15)20(23(19,21)22)14-8-3-2-7-13(14)17/h2-5,7-10,18H,6,11-12H2,1H3
NCI pathway
Reactome pathway
n/an/a 512n/an/an/an/an/an/a
Pfizer Global Research& Development
Curated by ChEMBL
Assay Description
Displacement of [3H]WIN35428 from human recombinant DAT expressed in CHO cells
J Med Chem 53: 4511-21 (2010)
Article DOI: 10.1021/jm100053t
BindingDB Entry DOI: 10.7270/Q2PC32JR
Sodium-dependent noradrenaline transporter
(Homo sapiens (Human))
BDBM50319577
(3-[3-(2-Fluorophenyl)-2,2-dioxido-2,1,3-benzothiad...)
Show SMILES CNCCCN1c2ccccc2N(c2ccccc2F)S1(=O)=O
Show InChI InChI=1S/C16H18FN3O2S/c1-18-11-6-12-19-15-9-4-5-10-16(15)20(23(19,21)22)14-8-3-2-7-13(14)17/h2-5,7-10,18H,6,11-12H2,1H3
Reactome pathway
n/an/a 2.70n/an/an/an/an/an/a
Pfizer Global Research& Development
Curated by ChEMBL
Assay Description
Displacement of [3H]nisoxetine from human NET expressed in MDCK-Net6 cells
J Med Chem 53: 4511-21 (2010)
Article DOI: 10.1021/jm100053t
BindingDB Entry DOI: 10.7270/Q2PC32JR