BDBM50319641 CHEMBL1085343::N-(1,3-dioxoisoindolin-5-yl)-2-phenylacetamide
SMILES: O=C(Cc1ccccc1)Nc1ccc2C(=O)NC(=O)c2c1
InChI Key: InChIKey=MMNISCSOZSMAQS-UHFFFAOYSA-N
Data: 1 IC50
Activity Spreadsheet -- Enzyme Inhibition Constant Data from BindingDB
Found 1 hit for monomerid = 50319641
Trg + Lig
Ki
nM
ΔG°
kcal/mole
IC50
nM
Kd
nM
EC50/IC50
nM
koff
s-1
kon
M-1s-1
pHTemp
°C
Rho-associated protein kinase 2
(Homo sapiens (Human))
BDBM50319641
(CHEMBL1085343 | N-(1,3-dioxoisoindolin-5-yl)-2-phe...)
Show SMILES O=C(Cc1ccccc1)Nc1ccc2C(=O)NC(=O)c2c1
Show InChI InChI=1S/C16H12N2O3/c19-14(8-10-4-2-1-3-5-10)17-11-6-7-12-13(9-11)16(21)18-15(12)20/h1-7,9H,8H2,(H,17,19)(H,18,20,21)
n/an/a>1.00E+4n/an/an/an/an/an/a
Boehringer Ingelheim Pharmaceuticals
Curated by ChEMBL
Assay Description
Inhibition of ROCK2
Bioorg Med Chem Lett 20: 3235-9 (2010)
Article DOI: 10.1016/j.bmcl.2010.04.070
BindingDB Entry DOI: 10.7270/Q21N819Z