BDBM50319647 CHEMBL1084846::N-(1-oxo-1,2-dihydroisoquinolin-7-yl)-2-phenylacetamide
SMILES: O=C(Cc1ccccc1)Nc1ccc2cc[nH]c(=O)c2c1
InChI Key: InChIKey=LNXXSDWYRUADKS-UHFFFAOYSA-N
Data: 1 IC50
Activity Spreadsheet -- Enzyme Inhibition Constant Data from BindingDB
Found 1 hit for monomerid = 50319647
Trg + Lig
Ki
nM
ΔG°
kcal/mole
IC50
nM
Kd
nM
EC50/IC50
nM
koff
s-1
kon
M-1s-1
pHTemp
°C
Rho-associated protein kinase 2
(Homo sapiens (Human))
BDBM50319647
(CHEMBL1084846 | N-(1-oxo-1,2-dihydroisoquinolin-7-...)
Show SMILES O=C(Cc1ccccc1)Nc1ccc2cc[nH]c(=O)c2c1
Show InChI InChI=1S/C17H14N2O2/c20-16(10-12-4-2-1-3-5-12)19-14-7-6-13-8-9-18-17(21)15(13)11-14/h1-9,11H,10H2,(H,18,21)(H,19,20)
n/an/a>1.00E+4n/an/an/an/an/an/a
Boehringer Ingelheim Pharmaceuticals
Curated by ChEMBL
Assay Description
Inhibition of ROCK2
Bioorg Med Chem Lett 20: 3235-9 (2010)
Article DOI: 10.1016/j.bmcl.2010.04.070
BindingDB Entry DOI: 10.7270/Q21N819Z