BDBM50319655 CHEMBL1085140::N-(7-chloro-1-oxo-1,2-dihydroisoquinolin-6-yl)-2-cyclohexylacetamide
SMILES: Clc1cc2c(cc[nH]c2=O)cc1NC(=O)CC1CCCCC1
InChI Key: InChIKey=ISIGAIQQUSLSCQ-UHFFFAOYSA-N
Data: 1 IC50
Activity Spreadsheet -- Enzyme Inhibition Constant Data from BindingDB
Found 1 hit for monomerid = 50319655
Trg + Lig
Ki
nM
ΔG°
kcal/mole
IC50
nM
Kd
nM
EC50/IC50
nM
koff
s-1
kon
M-1s-1
pHTemp
°C
Rho-associated protein kinase 2
(Homo sapiens (Human))
BDBM50319655
(CHEMBL1085140 | N-(7-chloro-1-oxo-1,2-dihydroisoqu...)
Show SMILES Clc1cc2c(cc[nH]c2=O)cc1NC(=O)CC1CCCCC1
Show InChI InChI=1S/C17H19ClN2O2/c18-14-10-13-12(6-7-19-17(13)22)9-15(14)20-16(21)8-11-4-2-1-3-5-11/h6-7,9-11H,1-5,8H2,(H,19,22)(H,20,21)
n/an/a 430n/an/an/an/an/an/a
Boehringer Ingelheim Pharmaceuticals
Curated by ChEMBL
Assay Description
Inhibition of ROCK2
Bioorg Med Chem Lett 20: 3235-9 (2010)
Article DOI: 10.1016/j.bmcl.2010.04.070
BindingDB Entry DOI: 10.7270/Q21N819Z