null
SMILES: CC(CCOC[C@H](O)CNC(C)(C)Cc1ccc2ccccc2c1)c1ccccc1
InChI Key: InChIKey=MNMGHGKHINQBJG-ZTDHTWSHSA-N
Activity Spreadsheet -- Enzyme Inhibition Constant Data from BindingDB
Found 1 hit for monomerid = 50319994
Trg + Lig
Ki
nM
ΔG°
kcal/mole
IC50
nM
Kd
nM
EC50/IC50
nM
koff
s-1
kon
M-1s-1
pHTemp
°C
Extracellular calcium-sensing receptor
(Homo sapiens (Human))
BDBM50319994
((2R)-1-(2-methyl-1-(naphthalen-2-yl)propan-2-ylami...)
Show SMILES CC(CCOC[C@H](O)CNC(C)(C)Cc1ccc2ccccc2c1)c1ccccc1 |r|
Show InChI InChI=1S/C27H35NO2/c1-21(23-9-5-4-6-10-23)15-16-30-20-26(29)19-28-27(2,3)18-22-13-14-24-11-7-8-12-25(24)17-22/h4-14,17,21,26,28-29H,15-16,18-20H2,1-3H3/t21?,26-/m1/s1
n/an/a 300n/an/an/an/an/an/a
Central Pharmaceutical Research Institute
Curated by ChEMBL
Assay Description
Antagonist activity at human CaSR expressed in rat PC12 cells transfected with zif promoter/luciferase by reporter gene assay
Bioorg Med Chem Lett 20: 3809-13 (2010)
Article DOI: 10.1016/j.bmcl.2010.04.035
BindingDB Entry DOI: 10.7270/Q2765FGD