null
SMILES: CC(OC[C@H](O)CNC(C)(C)Cc1ccc2ccccc2c1)c1ccccn1
InChI Key: InChIKey=NPVKQRBIYIVQQU-LMNIDFBRSA-N
Activity Spreadsheet -- Enzyme Inhibition Constant Data from BindingDB
Found 1 hit for monomerid = 50319995
Trg + Lig
Ki
nM
ΔG°
kcal/mole
IC50
nM
Kd
nM
EC50/IC50
nM
koff
s-1
kon
M-1s-1
pHTemp
°C
Extracellular calcium-sensing receptor
(Homo sapiens (Human))
BDBM50319995
((2R)-1-(2-methyl-1-(naphthalen-2-yl)propan-2-ylami...)
Show SMILES CC(OC[C@H](O)CNC(C)(C)Cc1ccc2ccccc2c1)c1ccccn1 |r|
Show InChI InChI=1S/C24H30N2O2/c1-18(23-10-6-7-13-25-23)28-17-22(27)16-26-24(2,3)15-19-11-12-20-8-4-5-9-21(20)14-19/h4-14,18,22,26-27H,15-17H2,1-3H3/t18?,22-/m1/s1
n/an/a 420n/an/an/an/an/an/a
Central Pharmaceutical Research Institute
Curated by ChEMBL
Assay Description
Antagonist activity at human CaSR expressed in rat PC12 cells transfected with zif promoter/luciferase by reporter gene assay
Bioorg Med Chem Lett 20: 3809-13 (2010)
Article DOI: 10.1016/j.bmcl.2010.04.035
BindingDB Entry DOI: 10.7270/Q2765FGD