null
SMILES: Cc1ccccc1[C@H](OC[C@@H](O)CNC(C)(C)Cc1ccc2ccccc2c1)C1CC1
InChI Key: InChIKey=PYNFKKBWKOSQPJ-AHKZPQOWSA-N
Activity Spreadsheet -- Enzyme Inhibition Constant Data from BindingDB
Found 1 hit for monomerid = 50320020
Trg + Lig
Ki
nM
ΔG°
kcal/mole
IC50
nM
Kd
nM
EC50/IC50
nM
koff
s-1
kon
M-1s-1
pHTemp
°C
Extracellular calcium-sensing receptor
(Homo sapiens (Human))
BDBM50320020
((S)-1-((R)-cyclopropyl(o-tolyl)methoxy)-3-(2-methy...)
Show SMILES Cc1ccccc1[C@H](OC[C@@H](O)CNC(C)(C)Cc1ccc2ccccc2c1)C1CC1 |r|
Show InChI InChI=1S/C28H35NO2/c1-20-8-4-7-11-26(20)27(23-14-15-23)31-19-25(30)18-29-28(2,3)17-21-12-13-22-9-5-6-10-24(22)16-21/h4-13,16,23,25,27,29-30H,14-15,17-19H2,1-3H3/t25-,27+/m0/s1
n/an/a 310n/an/an/an/an/an/a
Central Pharmaceutical Research Institute
Curated by ChEMBL
Assay Description
Antagonist activity at human CaSR expressed in rat PC12 cells transfected with zif promoter/luciferase by reporter gene assay
Bioorg Med Chem Lett 20: 3809-13 (2010)
Article DOI: 10.1016/j.bmcl.2010.04.035
BindingDB Entry DOI: 10.7270/Q2765FGD