null
SMILES: CCOC(=O)CNC(=O)C(=O)C(COCc1ccccc1)NC(=O)[C@H](CC1CCCCC1)NC(=O)C1=CC(=O)CC(C)(C)O1
InChI Key: InChIKey=OXIILJKDHGHLJY-SKCDSABHSA-N
Activity Spreadsheet -- Enzyme Inhibition Constant Data from BindingDB
Found 1 hit for monomerid = 50320047
Trg + Lig
Ki
nM
ΔG°
kcal/mole
IC50
nM
Kd
nM
EC50/IC50
nM
koff
s-1
kon
M-1s-1
pHTemp
°C
Cathepsin S
(Homo sapiens (Human))
BDBM50320047
(CHEMBL1085966 | Glycine, N-[(3S)-4-benzyloxy-3-[[[...)
Show SMILES CCOC(=O)CNC(=O)C(=O)C(COCc1ccccc1)NC(=O)[C@H](CC1CCCCC1)NC(=O)C1=CC(=O)CC(C)(C)O1 |r,t:37|
Show InChI InChI=1S/C32H43N3O9/c1-4-43-27(37)18-33-31(41)28(38)25(20-42-19-22-13-9-6-10-14-22)35-29(39)24(15-21-11-7-5-8-12-21)34-30(40)26-16-23(36)17-32(2,3)44-26/h6,9-10,13-14,16,21,24-25H,4-5,7-8,11-12,15,17-20H2,1-3H3,(H,33,41)(H,34,40)(H,35,39)/t24-,25?/m0/s1
Reactome pathway
n/an/a 4.30n/an/an/an/an/an/a
National Tsing Hua University
Curated by ChEMBL
Assay Description
Inhibition of human recombinant cathepsin S expressed in Escherichia coli BL21 (DE3) after 10 mins by fluorescence assay
J Med Chem 53: 4545-9 (2010)
Article DOI: 10.1021/jm100089e
BindingDB Entry DOI: 10.7270/Q2TX3FJ2