BDBM50320051 CHEMBL1085974::ethyl 2-(4-(benzyloxy)-3-((S)-3-cyclohexyl-2-(3-methyl-2-nitrobenzamido)propanamido)-2-oxobutanamido)acetate
SMILES: CCOC(=O)CNC(=O)C(=O)C(COCc1ccccc1)NC(=O)[C@H](CC1CCCCC1)NC(=O)c1cccc(C)c1[N+]([O-])=O
InChI Key: InChIKey=FBULSFFGXYTSJK-PMCHYTPCSA-N
Data: 1 IC50
Activity Spreadsheet -- Enzyme Inhibition Constant Data from BindingDB
Found 1 hit for monomerid = 50320051
Trg + Lig
Ki
nM
ΔG°
kcal/mole
IC50
nM
Kd
nM
EC50/IC50
nM
koff
s-1
kon
M-1s-1
pHTemp
°C
Cathepsin S
(Homo sapiens (Human))
BDBM50320051
(CHEMBL1085974 | ethyl 2-(4-(benzyloxy)-3-((S)-3-cy...)
Show SMILES CCOC(=O)CNC(=O)C(=O)C(COCc1ccccc1)NC(=O)[C@H](CC1CCCCC1)NC(=O)c1cccc(C)c1[N+]([O-])=O |r|
Show InChI InChI=1S/C32H40N4O9/c1-3-45-27(37)18-33-32(41)29(38)26(20-44-19-23-14-8-5-9-15-23)35-31(40)25(17-22-12-6-4-7-13-22)34-30(39)24-16-10-11-21(2)28(24)36(42)43/h5,8-11,14-16,22,25-26H,3-4,6-7,12-13,17-20H2,1-2H3,(H,33,41)(H,34,39)(H,35,40)/t25-,26?/m0/s1
Reactome pathway
n/an/a 5.60n/an/an/an/an/an/a
National Tsing Hua University
Curated by ChEMBL
Assay Description
Inhibition of human recombinant cathepsin S expressed in Escherichia coli BL21 (DE3) after 10 mins by fluorescence assay
J Med Chem 53: 4545-9 (2010)
Article DOI: 10.1021/jm100089e
BindingDB Entry DOI: 10.7270/Q2TX3FJ2