BDBM50320053 CHEMBL1085976::ethyl 2-(4-(benzyloxy)-3-((S)-3-cyclohexyl-2-(2,3-difluorobenzamido)propanamido)-2-oxobutanamido)acetate
SMILES: CCOC(=O)CNC(=O)C(=O)C(COCc1ccccc1)NC(=O)[C@H](CC1CCCCC1)NC(=O)c1cccc(F)c1F
InChI Key: InChIKey=LUWMXPLQGYPEMS-SKCDSABHSA-N
Data: 1 IC50
Activity Spreadsheet -- Enzyme Inhibition Constant Data from BindingDB
Found 1 hit for monomerid = 50320053
Trg + Lig
Ki
nM
ΔG°
kcal/mole
IC50
nM
Kd
nM
EC50/IC50
nM
koff
s-1
kon
M-1s-1
pHTemp
°C
Cathepsin S
(Homo sapiens (Human))
BDBM50320053
(CHEMBL1085976 | ethyl 2-(4-(benzyloxy)-3-((S)-3-cy...)
Show SMILES CCOC(=O)CNC(=O)C(=O)C(COCc1ccccc1)NC(=O)[C@H](CC1CCCCC1)NC(=O)c1cccc(F)c1F |r|
Show InChI InChI=1S/C31H37F2N3O7/c1-2-43-26(37)17-34-31(41)28(38)25(19-42-18-21-12-7-4-8-13-21)36-30(40)24(16-20-10-5-3-6-11-20)35-29(39)22-14-9-15-23(32)27(22)33/h4,7-9,12-15,20,24-25H,2-3,5-6,10-11,16-19H2,1H3,(H,34,41)(H,35,39)(H,36,40)/t24-,25?/m0/s1
Reactome pathway
n/an/a 5.90n/an/an/an/an/an/a
National Tsing Hua University
Curated by ChEMBL
Assay Description
Inhibition of human recombinant cathepsin S expressed in Escherichia coli BL21 (DE3) after 10 mins by fluorescence assay
J Med Chem 53: 4545-9 (2010)
Article DOI: 10.1021/jm100089e
BindingDB Entry DOI: 10.7270/Q2TX3FJ2