BDBM50320058 CHEMBL1085980::ethyl 2-(4-(benzyloxy)-3-((S)-3-cyclohexyl-2-(6-methylpyrazine-2-carboxamido)propanamido)-2-oxobutanamido)acetate
SMILES: CCOC(=O)CNC(=O)C(=O)C(COCc1ccccc1)NC(=O)[C@H](CC1CCCCC1)NC(=O)c1cncc(C)n1
InChI Key: InChIKey=PMWXSEXZWBCQSY-LFQPHHBNSA-N
Data: 1 IC50
Activity Spreadsheet -- Enzyme Inhibition Constant Data from BindingDB
Found 1 hit for monomerid = 50320058
Trg + Lig
Ki
nM
ΔG°
kcal/mole
IC50
nM
Kd
nM
EC50/IC50
nM
koff
s-1
kon
M-1s-1
pHTemp
°C
Cathepsin S
(Homo sapiens (Human))
BDBM50320058
(CHEMBL1085980 | ethyl 2-(4-(benzyloxy)-3-((S)-3-cy...)
Show SMILES CCOC(=O)CNC(=O)C(=O)C(COCc1ccccc1)NC(=O)[C@H](CC1CCCCC1)NC(=O)c1cncc(C)n1 |r|
Show InChI InChI=1S/C30H39N5O7/c1-3-42-26(36)17-32-30(40)27(37)25(19-41-18-22-12-8-5-9-13-22)35-28(38)23(14-21-10-6-4-7-11-21)34-29(39)24-16-31-15-20(2)33-24/h5,8-9,12-13,15-16,21,23,25H,3-4,6-7,10-11,14,17-19H2,1-2H3,(H,32,40)(H,34,39)(H,35,38)/t23-,25?/m0/s1
Reactome pathway
n/an/a 6.10n/an/an/an/an/an/a
National Tsing Hua University
Curated by ChEMBL
Assay Description
Inhibition of human recombinant cathepsin S expressed in Escherichia coli BL21 (DE3) after 10 mins by fluorescence assay
J Med Chem 53: 4545-9 (2010)
Article DOI: 10.1021/jm100089e
BindingDB Entry DOI: 10.7270/Q2TX3FJ2