BDBM50320064 CHEMBL1085969::Methyl 2-amino-4-([(1S)-2-(1-[(benzyloxy)methyl]-3-[(2-ethoxy-2-oxoethyl)amino]-2,3-dioxopropylamino)-1-(cyclohexylmethyl)-2-oxoethyl]aminocarbonyl)benzoate
SMILES: CCOC(=O)CNC(=O)C(=O)C(COCc1ccccc1)NC(=O)[C@H](CC1CCCCC1)NC(=O)c1ccc(C(=O)OC)c(N)c1
InChI Key: InChIKey=GAFMFBMFEMXIHQ-QBHOUYDASA-N
Data: 1 IC50
Activity Spreadsheet -- Enzyme Inhibition Constant Data from BindingDB
Found 1 hit for monomerid = 50320064
Trg + Lig
Ki
nM
ΔG°
kcal/mole
IC50
nM
Kd
nM
EC50/IC50
nM
koff
s-1
kon
M-1s-1
pHTemp
°C
Cathepsin S
(Homo sapiens (Human))
BDBM50320064
(CHEMBL1085969 | Methyl 2-amino-4-([(1S)-2-(1-[(ben...)
Show SMILES CCOC(=O)CNC(=O)C(=O)C(COCc1ccccc1)NC(=O)[C@H](CC1CCCCC1)NC(=O)c1ccc(C(=O)OC)c(N)c1 |r|
Show InChI InChI=1S/C33H42N4O9/c1-3-46-28(38)18-35-32(42)29(39)27(20-45-19-22-12-8-5-9-13-22)37-31(41)26(16-21-10-6-4-7-11-21)36-30(40)23-14-15-24(25(34)17-23)33(43)44-2/h5,8-9,12-15,17,21,26-27H,3-4,6-7,10-11,16,18-20,34H2,1-2H3,(H,35,42)(H,36,40)(H,37,41)/t26-,27?/m0/s1
Reactome pathway
n/an/a 5.80n/an/an/an/an/an/a
National Tsing Hua University
Curated by ChEMBL
Assay Description
Inhibition of human recombinant cathepsin S expressed in Escherichia coli BL21 (DE3) after 10 mins by fluorescence assay
J Med Chem 53: 4545-9 (2010)
Article DOI: 10.1021/jm100089e
BindingDB Entry DOI: 10.7270/Q2TX3FJ2