BDBM50320097 1-(2-((5-methoxy-2-(1,3,5-trimethyl-1H-pyrazol-4-yl)-1H-indol-3-yl)methylene)-3-oxo-2,3-dihydrobenzofuran-5-yl)-3-(4-(morpholine-4-carbonyl)phenyl)urea::CHEMBL1082617
SMILES: COc1ccc2[nH]c(c(\C=C3\Oc4ccc(NC(=O)Nc5ccc(cc5)C(=O)N5CCOCC5)cc4C3=O)c2c1)-c1c(C)nn(C)c1C
InChI Key: InChIKey=OPSZTODLQOKVPE-ZCTHSVRISA-N
Data: 2 IC50
Activity Spreadsheet -- Enzyme Inhibition Constant Data from BindingDB
Found 2 hits for monomerid = 50320097
Trg + Lig
Ki
nM
ΔG°
kcal/mole
IC50
nM
Kd
nM
EC50/IC50
nM
koff
s-1
kon
M-1s-1
pHTemp
°C
Serine/threonine-protein kinase mTOR
(Homo sapiens (Human))
BDBM50320097
(1-(2-((5-methoxy-2-(1,3,5-trimethyl-1H-pyrazol-4-y...)
Show SMILES COc1ccc2[nH]c(c(\C=C3\Oc4ccc(NC(=O)Nc5ccc(cc5)C(=O)N5CCOCC5)cc4C3=O)c2c1)-c1c(C)nn(C)c1C |(-2.53,-10.46,;-2.53,-12,;-1.2,-12.77,;-1.2,-14.32,;.14,-15.09,;1.47,-14.31,;2.94,-14.78,;3.85,-13.53,;2.94,-12.28,;3.54,-10.86,;2.77,-9.53,;3.4,-8.12,;2.25,-7.1,;2.25,-5.57,;.92,-4.79,;-.41,-5.57,;-1.75,-4.8,;-1.76,-3.26,;-.43,-2.49,;-3.1,-2.5,;-3.11,-.97,;-1.78,-.2,;-1.79,1.34,;-3.12,2.1,;-4.45,1.31,;-4.44,-.22,;-3.14,3.63,;-1.81,4.41,;-4.47,4.39,;-4.48,5.92,;-5.81,6.68,;-7.13,5.91,;-7.13,4.37,;-5.79,3.61,;-.41,-7.11,;.92,-7.86,;1.24,-9.37,;.21,-10.52,;1.47,-12.77,;.14,-12,;5.39,-13.53,;6.29,-14.78,;5.81,-16.25,;7.75,-14.31,;7.75,-12.77,;9,-11.86,;6.29,-12.29,;5.81,-10.82,)|
Show InChI InChI=1S/C36H34N6O6/c1-20-32(21(2)41(3)40-20)33-27(26-18-25(46-4)10-11-29(26)39-33)19-31-34(43)28-17-24(9-12-30(28)48-31)38-36(45)37-23-7-5-22(6-8-23)35(44)42-13-15-47-16-14-42/h5-12,17-19,39H,13-16H2,1-4H3,(H2,37,38,45)/b31-19+
NCI pathway
Reactome pathway
n/an/a 4.20n/an/an/an/an/an/a
Wyeth Research
Curated by ChEMBL
Assay Description
Inhibition of mTOR
Bioorg Med Chem Lett 20: 3526-9 (2010)
Article DOI: 10.1016/j.bmcl.2010.04.139
BindingDB Entry DOI: 10.7270/Q2FQ9WSC
Phosphatidylinositol 4,5-bisphosphate 3-kinase catalytic subunit alpha isoform
(Homo sapiens (Human))
BDBM50320097
(1-(2-((5-methoxy-2-(1,3,5-trimethyl-1H-pyrazol-4-y...)
Show SMILES COc1ccc2[nH]c(c(\C=C3\Oc4ccc(NC(=O)Nc5ccc(cc5)C(=O)N5CCOCC5)cc4C3=O)c2c1)-c1c(C)nn(C)c1C |(-2.53,-10.46,;-2.53,-12,;-1.2,-12.77,;-1.2,-14.32,;.14,-15.09,;1.47,-14.31,;2.94,-14.78,;3.85,-13.53,;2.94,-12.28,;3.54,-10.86,;2.77,-9.53,;3.4,-8.12,;2.25,-7.1,;2.25,-5.57,;.92,-4.79,;-.41,-5.57,;-1.75,-4.8,;-1.76,-3.26,;-.43,-2.49,;-3.1,-2.5,;-3.11,-.97,;-1.78,-.2,;-1.79,1.34,;-3.12,2.1,;-4.45,1.31,;-4.44,-.22,;-3.14,3.63,;-1.81,4.41,;-4.47,4.39,;-4.48,5.92,;-5.81,6.68,;-7.13,5.91,;-7.13,4.37,;-5.79,3.61,;-.41,-7.11,;.92,-7.86,;1.24,-9.37,;.21,-10.52,;1.47,-12.77,;.14,-12,;5.39,-13.53,;6.29,-14.78,;5.81,-16.25,;7.75,-14.31,;7.75,-12.77,;9,-11.86,;6.29,-12.29,;5.81,-10.82,)|
Show InChI InChI=1S/C36H34N6O6/c1-20-32(21(2)41(3)40-20)33-27(26-18-25(46-4)10-11-29(26)39-33)19-31-34(43)28-17-24(9-12-30(28)48-31)38-36(45)37-23-7-5-22(6-8-23)35(44)42-13-15-47-16-14-42/h5-12,17-19,39H,13-16H2,1-4H3,(H2,37,38,45)/b31-19+
NCI pathway
Reactome pathway
n/an/a 0.200n/an/an/an/an/an/a
Wyeth Research
Curated by ChEMBL
Assay Description
Inhibition of PI3Kalpha
Bioorg Med Chem Lett 20: 3526-9 (2010)
Article DOI: 10.1016/j.bmcl.2010.04.139
BindingDB Entry DOI: 10.7270/Q2FQ9WSC