BDBM50320109 (2S,4S)-4-fluoro-1-(2-(2-methyl-4-(4-(methylsulfonyl)piperazin-1-yl)-4-oxobutan-2-ylamino)acetyl)pyrrolidine-2-carbonitrile::CHEMBL1085595
SMILES: CC(C)(CC(=O)N1CCN(CC1)S(C)(=O)=O)NCC(=O)N1C[C@@H](F)C[C@H]1C#N
InChI Key: InChIKey=NSHBZQRESYODEB-KBPBESRZSA-N
Data: 4 IC50
Activity Spreadsheet -- Enzyme Inhibition Constant Data from BindingDB
Found 4 hits for monomerid = 50320109
Trg + Lig
Ki
nM
ΔG°
kcal/mole
IC50
nM
Kd
nM
EC50/IC50
nM
koff
s-1
kon
M-1s-1
pHTemp
°C
Dipeptidyl peptidase 4
(Homo sapiens (Human))
BDBM50320109
((2S,4S)-4-fluoro-1-(2-(2-methyl-4-(4-(methylsulfon...)
Show SMILES CC(C)(CC(=O)N1CCN(CC1)S(C)(=O)=O)NCC(=O)N1C[C@@H](F)C[C@H]1C#N |r|
Show InChI InChI=1S/C17H28FN5O4S/c1-17(2,20-11-16(25)23-12-13(18)8-14(23)10-19)9-15(24)21-4-6-22(7-5-21)28(3,26)27/h13-14,20H,4-9,11-12H2,1-3H3/t13-,14-/m0/s1
Reactome pathway
n/an/a 24n/an/an/an/an/an/a
National Health Research Institutes
Curated by ChEMBL
Assay Description
Inhibition of DPP4
Bioorg Med Chem Lett 20: 3596-600 (2010)
Article DOI: 10.1016/j.bmcl.2010.04.124
BindingDB Entry DOI: 10.7270/Q29Z953W
Dipeptidyl peptidase 4
(Homo sapiens (Human))
BDBM50320109
((2S,4S)-4-fluoro-1-(2-(2-methyl-4-(4-(methylsulfon...)
Show SMILES CC(C)(CC(=O)N1CCN(CC1)S(C)(=O)=O)NCC(=O)N1C[C@@H](F)C[C@H]1C#N |r|
Show InChI InChI=1S/C17H28FN5O4S/c1-17(2,20-11-16(25)23-12-13(18)8-14(23)10-19)9-15(24)21-4-6-22(7-5-21)28(3,26)27/h13-14,20H,4-9,11-12H2,1-3H3/t13-,14-/m0/s1
Reactome pathway
n/an/a 15n/an/an/an/an/an/a
National Health Research Institutes
Curated by ChEMBL
Assay Description
Inhibition of DPP4 in presence of 50% human serum
Bioorg Med Chem Lett 20: 3596-600 (2010)
Article DOI: 10.1016/j.bmcl.2010.04.124
BindingDB Entry DOI: 10.7270/Q29Z953W
Dipeptidyl peptidase 9
(Homo sapiens (Human))
BDBM50320109
((2S,4S)-4-fluoro-1-(2-(2-methyl-4-(4-(methylsulfon...)
Show SMILES CC(C)(CC(=O)N1CCN(CC1)S(C)(=O)=O)NCC(=O)N1C[C@@H](F)C[C@H]1C#N |r|
Show InChI InChI=1S/C17H28FN5O4S/c1-17(2,20-11-16(25)23-12-13(18)8-14(23)10-19)9-15(24)21-4-6-22(7-5-21)28(3,26)27/h13-14,20H,4-9,11-12H2,1-3H3/t13-,14-/m0/s1
n/an/a>2.00E+4n/an/an/an/an/an/a
National Health Research Institutes
Curated by ChEMBL
Assay Description
Inhibition of DPP9
Bioorg Med Chem Lett 20: 3596-600 (2010)
Article DOI: 10.1016/j.bmcl.2010.04.124
BindingDB Entry DOI: 10.7270/Q29Z953W
Dipeptidyl peptidase VIII
(Homo sapiens (Human))
BDBM50320109
((2S,4S)-4-fluoro-1-(2-(2-methyl-4-(4-(methylsulfon...)
Show SMILES CC(C)(CC(=O)N1CCN(CC1)S(C)(=O)=O)NCC(=O)N1C[C@@H](F)C[C@H]1C#N |r|
Show InChI InChI=1S/C17H28FN5O4S/c1-17(2,20-11-16(25)23-12-13(18)8-14(23)10-19)9-15(24)21-4-6-22(7-5-21)28(3,26)27/h13-14,20H,4-9,11-12H2,1-3H3/t13-,14-/m0/s1
n/an/a>2.00E+4n/an/an/an/an/an/a
National Health Research Institutes
Curated by ChEMBL
Assay Description
Inhibition of DPP8
Bioorg Med Chem Lett 20: 3596-600 (2010)
Article DOI: 10.1016/j.bmcl.2010.04.124
BindingDB Entry DOI: 10.7270/Q29Z953W