null
SMILES: CN1CCN(CC1)c1ccc(cc1)-c1cnn2c(N)c(cnc12)-c1cccc(O)c1
InChI Key: InChIKey=BMHCYYLFLWTPHZ-UHFFFAOYSA-N
Activity Spreadsheet -- Enzyme Inhibition Constant Data from BindingDB
Found 4 hits for monomerid = 50320214
Trg + Lig
Ki
nM
ΔG°
kcal/mole
IC50
nM
Kd
nM
EC50/IC50
nM
koff
s-1
kon
M-1s-1
pHTemp
°C
Tyrosine-protein kinase Lck
(Homo sapiens (Human))
BDBM50320214
(3-(7-amino-3-(4-(4-methylpiperazin-1-yl)phenyl)pyr...)
Show SMILES CN1CCN(CC1)c1ccc(cc1)-c1cnn2c(N)c(cnc12)-c1cccc(O)c1
Show InChI InChI=1S/C23H24N6O/c1-27-9-11-28(12-10-27)18-7-5-16(6-8-18)21-15-26-29-22(24)20(14-25-23(21)29)17-3-2-4-19(30)13-17/h2-8,13-15,30H,9-12,24H2,1H3
n/an/a 8n/an/an/an/an/an/a
Novartis Institute of Biomedical Research
Curated by ChEMBL
Assay Description
Inhibition of LCK in human Jurkat cells assessed as ZAP70 phosphorylation by FACS assay
Bioorg Med Chem Lett 20: 3628-31 (2010)
Article DOI: 10.1016/j.bmcl.2010.04.112
BindingDB Entry DOI: 10.7270/Q2XP754D
Vascular endothelial growth factor receptor 2
(Homo sapiens (Human))
BDBM50320214
(3-(7-amino-3-(4-(4-methylpiperazin-1-yl)phenyl)pyr...)
Show SMILES CN1CCN(CC1)c1ccc(cc1)-c1cnn2c(N)c(cnc12)-c1cccc(O)c1
Show InChI InChI=1S/C23H24N6O/c1-27-9-11-28(12-10-27)18-7-5-16(6-8-18)21-15-26-29-22(24)20(14-25-23(21)29)17-3-2-4-19(30)13-17/h2-8,13-15,30H,9-12,24H2,1H3
NCI pathway
Reactome pathway
n/an/a 96n/an/an/an/an/an/a
Novartis Institute of Biomedical Research
Curated by ChEMBL
Assay Description
Inhibition of KDR
Bioorg Med Chem Lett 20: 3628-31 (2010)
Article DOI: 10.1016/j.bmcl.2010.04.112
BindingDB Entry DOI: 10.7270/Q2XP754D
Tyrosine-protein kinase HCK
(Homo sapiens (Human))
BDBM50320214
(3-(7-amino-3-(4-(4-methylpiperazin-1-yl)phenyl)pyr...)
Show SMILES CN1CCN(CC1)c1ccc(cc1)-c1cnn2c(N)c(cnc12)-c1cccc(O)c1
Show InChI InChI=1S/C23H24N6O/c1-27-9-11-28(12-10-27)18-7-5-16(6-8-18)21-15-26-29-22(24)20(14-25-23(21)29)17-3-2-4-19(30)13-17/h2-8,13-15,30H,9-12,24H2,1H3
Reactome pathway
n/an/a 8n/an/an/an/an/an/a
Novartis Institute of Biomedical Research
Curated by ChEMBL
Assay Description
Inhibition of HCK
Bioorg Med Chem Lett 20: 3628-31 (2010)
Article DOI: 10.1016/j.bmcl.2010.04.112
BindingDB Entry DOI: 10.7270/Q2XP754D
Proto-oncogene tyrosine-protein kinase Src
(Homo sapiens (Human))
BDBM50320214
(3-(7-amino-3-(4-(4-methylpiperazin-1-yl)phenyl)pyr...)
Show SMILES CN1CCN(CC1)c1ccc(cc1)-c1cnn2c(N)c(cnc12)-c1cccc(O)c1
Show InChI InChI=1S/C23H24N6O/c1-27-9-11-28(12-10-27)18-7-5-16(6-8-18)21-15-26-29-22(24)20(14-25-23(21)29)17-3-2-4-19(30)13-17/h2-8,13-15,30H,9-12,24H2,1H3
n/an/a 2n/an/an/an/an/an/a
Novartis Institute of Biomedical Research
Curated by ChEMBL
Assay Description
Inhibition of SRC
Bioorg Med Chem Lett 20: 3628-31 (2010)
Article DOI: 10.1016/j.bmcl.2010.04.112
BindingDB Entry DOI: 10.7270/Q2XP754D