null
SMILES: OC(=O)C[C@H]1[C@@H](Cc2ccccc12)NC(=O)c1cc2sc(Cl)c(Cl)c2[nH]1
InChI Key: InChIKey=HMEJFKBSLZUVMF-GHMZBOCLSA-N
Activity Spreadsheet -- Enzyme Inhibition Constant Data from BindingDB
Found 2 hits for monomerid = 50320321
Trg + Lig
Ki
nM
ΔG°
kcal/mole
IC50
nM
Kd
nM
EC50/IC50
nM
koff
s-1
kon
M-1s-1
pHTemp
°C
Potassium voltage-gated channel subfamily H member 2
(Homo sapiens (Human))
BDBM50320321
(2-((1R,2R)-2-(2,3-dichloro-4H-thieno[3,2-b]pyrrole...)
Show SMILES OC(=O)C[C@H]1[C@@H](Cc2ccccc12)NC(=O)c1cc2sc(Cl)c(Cl)c2[nH]1 |r|
Show InChI InChI=1S/C18H14Cl2N2O3S/c19-15-16-13(26-17(15)20)7-12(21-16)18(25)22-11-5-8-3-1-2-4-9(8)10(11)6-14(23)24/h1-4,7,10-11,21H,5-6H2,(H,22,25)(H,23,24)/t10-,11-/m1/s1
Reactome pathway
n/an/a>3.00E+4n/an/an/an/an/an/a
AstraZeneca
Curated by ChEMBL
Assay Description
Inhibition of human ERG
Bioorg Med Chem Lett 20: 3511-4 (2010)
Article DOI: 10.1016/j.bmcl.2010.04.147
BindingDB Entry DOI: 10.7270/Q2571C66
Glycogen phosphorylase, liver form
(Homo sapiens (Human))
BDBM50320321
(2-((1R,2R)-2-(2,3-dichloro-4H-thieno[3,2-b]pyrrole...)
Show SMILES OC(=O)C[C@H]1[C@@H](Cc2ccccc12)NC(=O)c1cc2sc(Cl)c(Cl)c2[nH]1 |r|
Show InChI InChI=1S/C18H14Cl2N2O3S/c19-15-16-13(26-17(15)20)7-12(21-16)18(25)22-11-5-8-3-1-2-4-9(8)10(11)6-14(23)24/h1-4,7,10-11,21H,5-6H2,(H,22,25)(H,23,24)/t10-,11-/m1/s1
Reactome pathway
n/an/a 18n/an/an/an/an/an/a
AstraZeneca
Curated by ChEMBL
Assay Description
Inhibition of human recombinant liver glycogen phosphorylase by multienzyme-coupled reaction
Bioorg Med Chem Lett 20: 3511-4 (2010)
Article DOI: 10.1016/j.bmcl.2010.04.147
BindingDB Entry DOI: 10.7270/Q2571C66