BDBM50320341 (R)-(4-(4-(4-chlorophenyl)phthalazin-1-yl)-3-methylpiperazin-1-yl)(phenyl)methanone::CHEMBL1086467
SMILES: C[C@@H]1CN(CCN1c1nnc(-c2ccc(Cl)cc2)c2ccccc12)C(=O)c1ccccc1
InChI Key: InChIKey=CHNHCRBXHMOZTQ-GOSISDBHSA-N
Data: 1 IC50
Activity Spreadsheet -- Enzyme Inhibition Constant Data from BindingDB
Found 1 hit for monomerid = 50320341
Trg + Lig
Ki
nM
ΔG°
kcal/mole
IC50
nM
Kd
nM
EC50/IC50
nM
koff
s-1
kon
M-1s-1
pHTemp
°C
G-protein- coupled-like receptor Smoothened (Smo)
(Homo sapiens (Human))
BDBM50320341
((R)-(4-(4-(4-chlorophenyl)phthalazin-1-yl)-3-methy...)
Show SMILES C[C@@H]1CN(CCN1c1nnc(-c2ccc(Cl)cc2)c2ccccc12)C(=O)c1ccccc1 |r|
Show InChI InChI=1S/C26H23ClN4O/c1-18-17-30(26(32)20-7-3-2-4-8-20)15-16-31(18)25-23-10-6-5-9-22(23)24(28-29-25)19-11-13-21(27)14-12-19/h2-14,18H,15-17H2,1H3/t18-/m1/s1
n/an/a 0.700n/an/an/an/an/an/a
AMGEN
Curated by ChEMBL
Assay Description
Inhibition of human SMO expressed in HEPM cells
Bioorg Med Chem Lett 20: 3618-22 (2010)
Article DOI: 10.1016/j.bmcl.2010.04.110
BindingDB Entry DOI: 10.7270/Q2WQ03ZQ