BDBM50320345 (S)-(2-methyl-4-(4-p-tolylphthalazin-1-yl)piperazin-1-yl)(phenyl)methanone::CHEMBL1083284
SMILES: C[C@H]1CN(CCN1C(=O)c1ccccc1)c1nnc(-c2ccc(C)cc2)c2ccccc12
InChI Key: InChIKey=NOHJOTARDCVDLY-FQEVSTJZSA-N
Data: 1 IC50
Activity Spreadsheet -- Enzyme Inhibition Constant Data from BindingDB
Found 1 hit for monomerid = 50320345
Trg + Lig
Ki
nM
ΔG°
kcal/mole
IC50
nM
Kd
nM
EC50/IC50
nM
koff
s-1
kon
M-1s-1
pHTemp
°C
G-protein- coupled-like receptor Smoothened (Smo)
(Homo sapiens (Human))
BDBM50320345
((S)-(2-methyl-4-(4-p-tolylphthalazin-1-yl)piperazi...)
Show SMILES C[C@H]1CN(CCN1C(=O)c1ccccc1)c1nnc(-c2ccc(C)cc2)c2ccccc12 |r|
Show InChI InChI=1S/C27H26N4O/c1-19-12-14-21(15-13-19)25-23-10-6-7-11-24(23)26(29-28-25)30-16-17-31(20(2)18-30)27(32)22-8-4-3-5-9-22/h3-15,20H,16-18H2,1-2H3/t20-/m0/s1
n/an/a 3.20n/an/an/an/an/an/a
AMGEN
Curated by ChEMBL
Assay Description
Inhibition of human SMO expressed in HEPM cells
Bioorg Med Chem Lett 20: 3618-22 (2010)
Article DOI: 10.1016/j.bmcl.2010.04.110
BindingDB Entry DOI: 10.7270/Q2WQ03ZQ