BDBM50320451 CHEMBL1163875::puupehedione
SMILES: CC1(C)CCC[C@@]2(C)[C@H]1CC[C@]1(C)OC3=CC(=O)C(=O)C=C3C=C21
InChI Key: InChIKey=QLFLHSQZFRDPFM-YYWHXJBOSA-N
Data: 3 IC50
Activity Spreadsheet -- Enzyme Inhibition Constant Data from BindingDB
Found 3 hits for monomerid = 50320451
Trg + Lig
Ki
nM
ΔG°
kcal/mole
IC50
nM
Kd
nM
EC50/IC50
nM
koff
s-1
kon
M-1s-1
pHTemp
°C
Arachidonate 15-lipoxygenase
(Homo sapiens (Human))
BDBM50320451
(CHEMBL1163875 | puupehedione)
Show SMILES CC1(C)CCC[C@@]2(C)[C@H]1CC[C@]1(C)OC3=CC(=O)C(=O)C=C3C=C21 |r,c:21,t:15,24|
Show InChI InChI=1S/C21H26O3/c1-19(2)7-5-8-20(3)17(19)6-9-21(4)18(20)11-13-10-14(22)15(23)12-16(13)24-21/h10-12,17H,5-9H2,1-4H3/t17-,20-,21-/m0/s1
Reactome pathway
n/an/a 7.00E+3n/an/an/an/an/an/a
University of California Santa Cruz
Curated by ChEMBL
Assay Description
Inhibition of human reticulocyte N-terminal His6-tagged 15-lipoxygenase by UV-vis spectrometry
J Nat Prod 72: 1857-63 (2009)
Article DOI: 10.1021/np900465e
BindingDB Entry DOI: 10.7270/Q2DB82TD
12-Lipoxygenase (12-LOX)
(Homo sapiens (Human))
BDBM50320451
(CHEMBL1163875 | puupehedione)
Show SMILES CC1(C)CCC[C@@]2(C)[C@H]1CC[C@]1(C)OC3=CC(=O)C(=O)C=C3C=C21 |r,c:21,t:15,24|
Show InChI InChI=1S/C21H26O3/c1-19(2)7-5-8-20(3)17(19)6-9-21(4)18(20)11-13-10-14(22)15(23)12-16(13)24-21/h10-12,17H,5-9H2,1-4H3/t17-,20-,21-/m0/s1
n/an/a 1.80E+4n/an/an/an/an/an/a
University of California Santa Cruz
Curated by ChEMBL
Assay Description
Inhibition of human platelet N-terminal His6-tagged 12-lipoxygenase by UV-vis spectrometry
J Nat Prod 72: 1857-63 (2009)
Article DOI: 10.1021/np900465e
BindingDB Entry DOI: 10.7270/Q2DB82TD
Arachidonate 5-lipoxygenase
(Homo sapiens (Human))
BDBM50320451
(CHEMBL1163875 | puupehedione)
Show SMILES CC1(C)CCC[C@@]2(C)[C@H]1CC[C@]1(C)OC3=CC(=O)C(=O)C=C3C=C21 |r,c:21,t:15,24|
Show InChI InChI=1S/C21H26O3/c1-19(2)7-5-8-20(3)17(19)6-9-21(4)18(20)11-13-10-14(22)15(23)12-16(13)24-21/h10-12,17H,5-9H2,1-4H3/t17-,20-,21-/m0/s1
Reactome pathway
n/an/a 4.60E+3n/an/an/an/an/an/a
University of California Santa Cruz
Curated by ChEMBL
Assay Description
Inhibition of human N-terminal His6-tagged 5-lipoxygenase arachidonic acid by UV-vis spectrometry
J Nat Prod 72: 1857-63 (2009)
Article DOI: 10.1021/np900465e
BindingDB Entry DOI: 10.7270/Q2DB82TD